{"text_format":"1","workbook":"xlsx","n_sheets":16,"sheets":["Mode d'emploi","Pairing List calcul","Pairing Officielle","Général","Général_Officiel","Analyse","Eq.1","Eq.2","Eq.3","Eq.4","Eq.5","Eq.6","Eq.7","Eq.8","Eq.9","Eq.10"],"not_rendered":{"charts":0,"images":0,"macros":1,"external_links":0,"defined_names":1,"comments":0,"pivot_tables":0},"unopened":[],"bounds":{"document_bytes":16777216,"sheet_cells":100000,"rows_first":2000,"rows_last":500,"rows_between":2000,"halvings":0,"cell_chars":16384,"cell_head_chars":4096},"cells_cut":0,"cells_raw":0,"read":"whole","date_system":"1900"}

{"sheet":"Mode d'emploi","index":0,"n_rows":6,"n_cols":1,"rows_kept":6,"cut":false,"hidden":false,"merged":[[4,0,4,11]]}
["MODE D'EMPLOI DU FICHIER PAIRING FLOTTE PARTAGEE DE TYPE LIGUE NATIONALE DE VOILE"]
["1- Onglet Général : Compléter les cellules B3 à B32 avec les noms des équipes (si le nom n'est pas rentré la cellule restera rouge, sinon elle deviendra orange)"]
["2- Onglet pairing officielle : elle se complète automatiquement. L'imprimer pour les équipes et l'organisation. Elle est arbitrairement établie pour un programme de 18 flights.\nLa durée d'un flight de 2 courses, avec 6 bateaux et les rotations d'équipes entre les 2 courses, est estimé à 40 mn.\nSur une journée type de 6h sur l'eau, on peut envisager 9 flights par jour.\nCette pairing est donc prévue pour 2 jours d'évènements.\nOn peut prévoir également une phase finale avec les 4 finalistes."]
["Pendant la régate :"]
["Onglet Général : Compléter les résultats des courses. \nPar exemple pour le flight 1, compléter la ligne 37  \"Place\" avec les résultats de la Race 1 du flight, puis la ligne 39 \"Place\" de la Race 2 du flight. \nSi un équipage est BFD, DNF, DSQ (ou toutes autres pénalités \"en lettres\", il faut indiquer le nombre de point (et pas les lettres).\nSi des pénalités numériques ont été infligées, en plus, à des équipes (dommage par exemple), compléter la colonne S.\nCette colonne regroupe la somme des pénalités reçues sur la totalité de la régate : en cas de nouvelles pénalités, indiquer simplement la somme des pénalités."]
["Onglet général : Mettre à jour le classement général en cliquant sur le bouton bleu \"Classement Général\". L'onglet Général Officiel se met alors à jour."]

{"sheet":"Pairing List calcul","index":1,"n_rows":37,"n_cols":7,"rows_kept":37,"cut":false,"hidden":true,"merged":[[19,0,20,0],[21,0,22,0],[33,0,34,0],[35,0,36,0],[11,0,12,0],[23,0,24,0],[25,0,26,0],[27,0,28,0],[29,0,30,0],[31,0,32,0],[13,0,14,0],[15,0,16,0],[17,0,18,0],[1,0,2,0],[3,0,4,0],[5,0,6,0],[7,0,8,0],[9,0,10,0]]}
["Flight","Race","Boat 1","Boat 2","Boat 3","Boat 4","Boat 5"]
[1,1,7,10,4,6,1]
[null,2,8,5,9,3,2]
[2,3,8,4,9,10,6]
[null,4,5,2,3,1,7]
[3,5,5,8,4,10,7]
[null,6,1,2,3,9,6]
[4,7,10,7,3,9,6]
[null,8,2,4,8,5,1]
[5,9,2,3,6,9,7]
[null,10,4,10,8,5,1]
[6,11,3,7,2,6,1]
[null,12,4,8,9,10,5]
[7,13,4,8,7,10,5]
[null,14,6,9,1,3,2]
[8,15,6,9,5,4,7]
[null,16,10,1,3,2,8]
[9,17,6,1,9,2,4]
[null,18,3,8,5,7,10]
[10,19,3,6,5,7,2]
[null,20,10,4,1,8,9]
[11,21,5,2,6,8,9]
[null,22,1,7,10,4,3]
[12,23,9,6,10,2,3]
[null,24,8,5,7,1,4]
[13,25,8,3,2,1,9]
[null,26,4,7,6,5,10]
[14,27,9,2,6,5,8]
[null,28,7,1,10,4,3]
[15,29,8,1,2,4,5]
[null,30,9,7,10,6,3]
[16,31,1,7,10,6,4]
[null,32,3,9,2,5,8]
[17,33,3,9,7,6,8]
[null,34,1,10,4,5,2]
[18,35,9,10,4,5,8]
[null,36,3,7,2,6,1]

{"sheet":"Pairing Officielle","index":2,"n_rows":73,"n_cols":6,"rows_kept":73,"cut":false,"hidden":false,"merged":[[1,0,1,5],[5,0,5,5],[9,0,9,5],[13,0,13,5],[17,0,17,5],[21,0,21,5],[25,0,25,5],[49,0,49,5],[53,0,53,5],[57,0,57,5],[41,0,41,5],[65,0,65,5],[69,0,69,5],[45,0,45,5],[29,0,29,5],[33,0,33,5],[37,0,37,5],[61,0,61,5]]}
[]
["Flight 1"]
[{"$f":"Général!A33","v":"Race"},{"$f":"'Pairing List calcul'!C1","v":"Boat 1"},{"$f":"'Pairing List calcul'!D1","v":"Boat 2"},{"$f":"'Pairing List calcul'!E1","v":"Boat 3"},{"$f":"'Pairing List calcul'!F1","v":"Boat 4"},{"$f":"'Pairing List calcul'!G1","v":"Boat 5"}]
[{"$f":"Général!A34","v":1},{"$f":"Général!B34","v":"Equipage 7"},{"$f":"Général!C34","v":"Equipage 10"},{"$f":"Général!D34","v":"Equipage 4"},{"$f":"Général!E34","v":"Equipage 6"},{"$f":"Général!F34","v":"Equipage 1"}]
[{"$f":"Général!A36","v":2},{"$f":"Général!B36","v":"Equipage 8"},{"$f":"Général!C36","v":"Equipage 5"},{"$f":"Général!D36","v":"Equipage 9"},{"$f":"Général!E36","v":"Equipage 3"},{"$f":"Général!F36","v":"Equipage 2"}]
["Flight 2"]
[{"$f":"Général!A41","v":"Race"},{"$f":"B3","v":"Boat 1"},"Boat 2","Boat 3","Boat 4","Boat 5"]
[{"$f":"Général!A42","v":3},{"$f":"Général!B42","v":"Equipage 8"},{"$f":"Général!C42","v":"Equipage 4"},{"$f":"Général!D42","v":"Equipage 9"},{"$f":"Général!E42","v":"Equipage 10"},{"$f":"Général!F42","v":"Equipage 6"}]
[{"$f":"Général!A44","v":4},{"$f":"Général!B44","v":"Equipage 5"},{"$f":"Général!C44","v":"Equipage 2"},{"$f":"Général!D44","v":"Equipage 3"},{"$f":"Général!E44","v":"Equipage 1"},{"$f":"Général!F44","v":"Equipage 7"}]
["Flight 3"]
[{"$f":"Général!A49","v":"Race"},{"$f":"B3","v":"Boat 1"},"Boat 2","Boat 3","Boat 4","Boat 5"]
[{"$f":"Général!A50","v":5},{"$f":"Général!B50","v":"Equipage 5"},{"$f":"Général!C50","v":"Equipage 8"},{"$f":"Général!D50","v":"Equipage 4"},{"$f":"Général!E50","v":"Equipage 10"},{"$f":"Général!F50","v":"Equipage 7"}]
[{"$f":"Général!A52","v":6},{"$f":"Général!B52","v":"Equipage 1"},{"$f":"Général!C52","v":"Equipage 2"},{"$f":"Général!D52","v":"Equipage 3"},{"$f":"Général!E52","v":"Equipage 9"},{"$f":"Général!F52","v":"Equipage 6"}]
["Flight 4"]
[{"$f":"Général!A57","v":"Race"},{"$f":"B3","v":"Boat 1"},"Boat 2","Boat 3","Boat 4","Boat 5"]
[{"$f":"Général!A58","v":7},{"$f":"Général!B58","v":"Equipage 10"},{"$f":"Général!C58","v":"Equipage 7"},{"$f":"Général!D58","v":"Equipage 3"},{"$f":"Général!E58","v":"Equipage 9"},{"$f":"Général!F58","v":"Equipage 6"}]
[{"$f":"Général!A60","v":8},{"$f":"Général!B60","v":"Equipage 2"},{"$f":"Général!C60","v":"Equipage 4"},{"$f":"Général!D60","v":"Equipage 8"},{"$f":"Général!E60","v":"Equipage 5"},{"$f":"Général!F60","v":"Equipage 1"}]
["Flight 5"]
[{"$f":"Général!A65","v":"Race"},{"$f":"B3","v":"Boat 1"},"Boat 2","Boat 3","Boat 4","Boat 5"]
[{"$f":"Général!A66","v":9},{"$f":"Général!B66","v":"Equipage 2"},{"$f":"Général!C66","v":"Equipage 3"},{"$f":"Général!D66","v":"Equipage 6"},{"$f":"Général!E66","v":"Equipage 9"},{"$f":"Général!F66","v":"Equipage 7"}]
[{"$f":"Général!A68","v":10},{"$f":"Général!B68","v":"Equipage 4"},{"$f":"Général!C68","v":"Equipage 10"},{"$f":"Général!D68","v":"Equipage 8"},{"$f":"Général!E68","v":"Equipage 5"},{"$f":"Général!F68","v":"Equipage 1"}]
["Flight 6"]
[{"$f":"Général!A73","v":"Race"},{"$f":"B3","v":"Boat 1"},"Boat 2","Boat 3","Boat 4","Boat 5"]
[{"$f":"Général!A74","v":11},{"$f":"Général!B74","v":"Equipage 3"},{"$f":"Général!C74","v":"Equipage 7"},{"$f":"Général!D74","v":"Equipage 2"},{"$f":"Général!E74","v":"Equipage 6"},{"$f":"Général!F74","v":"Equipage 1"}]
[{"$f":"Général!A76","v":12},{"$f":"Général!B76","v":"Equipage 4"},{"$f":"Général!C76","v":"Equipage 8"},{"$f":"Général!D76","v":"Equipage 9"},{"$f":"Général!E76","v":"Equipage 10"},{"$f":"Général!F76","v":"Equipage 5"}]
["Flight 7"]
[{"$f":"Général!A81","v":"Race"},{"$f":"B3","v":"Boat 1"},"Boat 2","Boat 3","Boat 4","Boat 5"]
[{"$f":"Général!A82","v":13},{"$f":"Général!B82","v":"Equipage 4"},{"$f":"Général!C82","v":"Equipage 8"},{"$f":"Général!D82","v":"Equipage 7"},{"$f":"Général!E82","v":"Equipage 10"},{"$f":"Général!F82","v":"Equipage 5"}]
[{"$f":"Général!A84","v":14},{"$f":"Général!B84","v":"Equipage 6"},{"$f":"Général!C84","v":"Equipage 9"},{"$f":"Général!D84","v":"Equipage 1"},{"$f":"Général!E84","v":"Equipage 3"},{"$f":"Général!F84","v":"Equipage 2"}]
["Flight 8"]
[{"$f":"Général!A89","v":"Race"},{"$f":"B3","v":"Boat 1"},"Boat 2","Boat 3","Boat 4","Boat 5"]
[{"$f":"Général!A90","v":15},{"$f":"Général!B90","v":"Equipage 6"},{"$f":"Général!C90","v":"Equipage 9"},{"$f":"Général!D90","v":"Equipage 5"},{"$f":"Général!E90","v":"Equipage 4"},{"$f":"Général!F90","v":"Equipage 7"}]
[{"$f":"Général!A92","v":16},{"$f":"Général!B92","v":"Equipage 10"},{"$f":"Général!C92","v":"Equipage 1"},{"$f":"Général!D92","v":"Equipage 3"},{"$f":"Général!E92","v":"Equipage 2"},{"$f":"Général!F92","v":"Equipage 8"}]
["Flight 9"]
[{"$f":"Général!A97","v":"Race"},{"$f":"B3","v":"Boat 1"},"Boat 2","Boat 3","Boat 4","Boat 5"]
[{"$f":"Général!A98","v":17},{"$f":"Général!B98","v":"Equipage 6"},{"$f":"Général!C98","v":"Equipage 1"},{"$f":"Général!D98","v":"Equipage 9"},{"$f":"Général!E98","v":"Equipage 2"},{"$f":"Général!F98","v":"Equipage 4"}]
[{"$f":"Général!A100","v":18},{"$f":"Général!B100","v":"Equipage 3"},{"$f":"Général!C100","v":"Equipage 8"},{"$f":"Général!D100","v":"Equipage 5"},{"$f":"Général!E100","v":"Equipage 7"},{"$f":"Général!F100","v":"Equipage 10"}]
["Flight 10"]
[{"$f":"Général!A105","v":"Race"},{"$f":"B3","v":"Boat 1"},"Boat 2","Boat 3","Boat 4","Boat 5"]
[{"$f":"Général!A106","v":19},{"$f":"Général!B106","v":"Equipage 3"},{"$f":"Général!C106","v":"Equipage 6"},{"$f":"Général!D106","v":"Equipage 5"},{"$f":"Général!E106","v":"Equipage 7"},{"$f":"Général!F106","v":"Equipage 2"}]
[{"$f":"Général!A108","v":20},{"$f":"Général!B108","v":"Equipage 10"},{"$f":"Général!C108","v":"Equipage 4"},{"$f":"Général!D108","v":"Equipage 1"},{"$f":"Général!E108","v":"Equipage 8"},{"$f":"Général!F108","v":"Equipage 9"}]
["Flight 11"]
[{"$f":"Général!A113","v":"Race"},{"$f":"B3","v":"Boat 1"},"Boat 2","Boat 3","Boat 4","Boat 5"]
[{"$f":"Général!A114","v":21},{"$f":"Général!B114","v":"Equipage 5"},{"$f":"Général!C114","v":"Equipage 2"},{"$f":"Général!D114","v":"Equipage 6"},{"$f":"Général!E114","v":"Equipage 8"},{"$f":"Général!F114","v":"Equipage 9"}]
[{"$f":"Général!A116","v":22},{"$f":"Général!B116","v":"Equipage 1"},{"$f":"Général!C116","v":"Equipage 7"},{"$f":"Général!D116","v":"Equipage 10"},{"$f":"Général!E116","v":"Equipage 4"},{"$f":"Général!F116","v":"Equipage 3"}]
["Flight 12"]
[{"$f":"Général!A121","v":"Race"},{"$f":"B3","v":"Boat 1"},"Boat 2","Boat 3","Boat 4","Boat 5"]
[{"$f":"Général!A122","v":23},{"$f":"Général!B122","v":"Equipage 9"},{"$f":"Général!C122","v":"Equipage 6"},{"$f":"Général!D122","v":"Equipage 10"},{"$f":"Général!E122","v":"Equipage 2"},{"$f":"Général!F122","v":"Equipage 3"}]
[{"$f":"Général!A124","v":24},{"$f":"Général!B124","v":"Equipage 8"},{"$f":"Général!C124","v":"Equipage 5"},{"$f":"Général!D124","v":"Equipage 7"},{"$f":"Général!E124","v":"Equipage 1"},{"$f":"Général!F124","v":"Equipage 4"}]
["Flight 13"]
[{"$f":"Général!A129","v":"Race"},{"$f":"B3","v":"Boat 1"},"Boat 2","Boat 3","Boat 4","Boat 5"]
[{"$f":"Général!A130","v":25},{"$f":"Général!B130","v":"Equipage 8"},{"$f":"Général!C130","v":"Equipage 3"},{"$f":"Général!D130","v":"Equipage 2"},{"$f":"Général!E130","v":"Equipage 1"},{"$f":"Général!F130","v":"Equipage 9"}]
[{"$f":"Général!A132","v":26},{"$f":"Général!B132","v":"Equipage 4"},{"$f":"Général!C132","v":"Equipage 7"},{"$f":"Général!D132","v":"Equipage 6"},{"$f":"Général!E132","v":"Equipage 5"},{"$f":"Général!F132","v":"Equipage 10"}]
["Flight 14"]
[{"$f":"Général!A137","v":"Race"},{"$f":"B3","v":"Boat 1"},"Boat 2","Boat 3","Boat 4","Boat 5"]
[{"$f":"Général!A138","v":27},{"$f":"Général!B138","v":"Equipage 9"},{"$f":"Général!C138","v":"Equipage 2"},{"$f":"Général!D138","v":"Equipage 6"},{"$f":"Général!E138","v":"Equipage 5"},{"$f":"Général!F138","v":"Equipage 8"}]
[{"$f":"Général!A140","v":28},{"$f":"Général!B140","v":"Equipage 7"},{"$f":"Général!C140","v":"Equipage 1"},{"$f":"Général!D140","v":"Equipage 10"},{"$f":"Général!E140","v":"Equipage 4"},{"$f":"Général!F140","v":"Equipage 3"}]
["Flight 15"]
[{"$f":"Général!A145","v":"Race"},{"$f":"B3","v":"Boat 1"},"Boat 2","Boat 3","Boat 4","Boat 5"]
[{"$f":"Général!A146","v":29},{"$f":"Général!B146","v":"Equipage 8"},{"$f":"Général!C146","v":"Equipage 1"},{"$f":"Général!D146","v":"Equipage 2"},{"$f":"Général!E146","v":"Equipage 4"},{"$f":"Général!F146","v":"Equipage 5"}]
[{"$f":"Général!A148","v":30},{"$f":"Général!B148","v":"Equipage 9"},{"$f":"Général!C148","v":"Equipage 7"},{"$f":"Général!D148","v":"Equipage 10"},{"$f":"Général!E148","v":"Equipage 6"},{"$f":"Général!F148","v":"Equipage 3"}]
["Flight 16"]
[{"$f":"Général!A153","v":"Race"},{"$f":"B3","v":"Boat 1"},"Boat 2","Boat 3","Boat 4","Boat 5"]
[{"$f":"Général!A154","v":31},{"$f":"Général!B154","v":"Equipage 1"},{"$f":"Général!C154","v":"Equipage 7"},{"$f":"Général!D154","v":"Equipage 10"},{"$f":"Général!E154","v":"Equipage 6"},{"$f":"Général!F154","v":"Equipage 4"}]
[{"$f":"Général!A156","v":32},{"$f":"Général!B156","v":"Equipage 3"},{"$f":"Général!C156","v":"Equipage 9"},{"$f":"Général!D156","v":"Equipage 2"},{"$f":"Général!E156","v":"Equipage 5"},{"$f":"Général!F156","v":"Equipage 8"}]
["Flight 17"]
[{"$f":"Général!A159","v":"Race"},{"$f":"B7","v":"Boat 1"},"Boat 2","Boat 3","Boat 4","Boat 5"]
[{"$f":"Général!A160","v":33},{"$f":"Général!B160","v":"Equipage 1"},{"$f":"Général!C160","v":"Equipage 7"},{"$f":"Général!D160","v":"Equipage 10"},{"$f":"Général!E160","v":"Equipage 6"},{"$f":"Général!F160","v":"Equipage 4"}]
[{"$f":"Général!A162","v":34},{"$f":"Général!B162","v":"Equipage 3"},{"$f":"Général!C162","v":"Equipage 9"},{"$f":"Général!D162","v":"Equipage 2"},{"$f":"Général!E162","v":"Equipage 5"},{"$f":"Général!F162","v":"Equipage 8"}]
["Flight 18"]
[{"$f":"Général!A165","v":"Race"},{"$f":"B11","v":"Boat 1"},"Boat 2","Boat 3","Boat 4","Boat 5"]
[{"$f":"Général!A166","v":35},{"$f":"Général!B166","v":"Equipage 1"},{"$f":"Général!C166","v":"Equipage 7"},{"$f":"Général!D166","v":"Equipage 10"},{"$f":"Général!E166","v":"Equipage 6"},{"$f":"Général!F166","v":"Equipage 4"}]
[{"$f":"Général!A168","v":36},{"$f":"Général!B168","v":"Equipage 3"},{"$f":"Général!C168","v":"Equipage 9"},{"$f":"Général!D168","v":"Equipage 2"},{"$f":"Général!E168","v":"Equipage 5"},{"$f":"Général!F168","v":"Equipage 8"}]

{"sheet":"Général","index":3,"n_rows":169,"n_cols":32,"rows_kept":169,"cut":false,"hidden":false,"merged":[[11,31,11,32],[4,31,4,32],[5,31,5,32],[6,31,6,32],[1,31,1,32],[2,31,2,32],[7,31,7,32],[8,31,8,32],[9,31,9,32],[3,31,3,32],[10,31,10,32],[30,22,30,23],[170,0,177,0],[172,12,176,12],[153,12,160,12],[153,21,160,21],[172,21,176,21],[169,0,169,2],[169,4,169,6],[152,12,152,14],[152,21,152,23],[162,12,166,12],[162,21,166,21],[171,12,171,14],[171,21,171,23],[206,0,210,0],[206,4,210,4],[206,8,210,8],[201,0,205,0],[201,4,205,4],[201,8,205,8],[182,21,186,21],[178,0,185,0],[196,0,200,0],[196,4,200,4],[196,8,200,8],[178,4,182,4],[177,12,181,12],[177,21,181,21],[186,0,190,0],[186,4,190,4],[182,12,186,12],[195,0,195,2],[195,4,195,6],[170,4,174,4],[111,0,111,5],[127,0,127,5],[119,0,119,5],[151,0,151,5],[143,0,143,5],[135,0,135,5],[163,0,163,5],[157,0,157,5],[47,0,47,5],[39,0,39,5],[31,0,31,5],[55,0,55,5],[63,0,63,5],[71,0,71,5],[103,0,103,5],[95,0,95,5],[87,0,87,5],[79,0,79,5]]}
[null,null,null,null,null,null,null,null,null,null,null,null,null,null,null,null,null,null,null,null,null,null,null,1,2,3,4,5,6,6]
["NUM","EQUIPAGE","FLIGHT 1","FLIGHT 2","FLIGHT 3","FLIGHT 4","FLIGHT 5","FLIGHT 6","FLIGHT 7","FLIGHT 8","FLIGHT 9","FLIGHT 10","FLIGHT 11","FLIGHT 12","FLIGHT 13","FLIGHT 14","FLIGHT 15","FLIGHT 16","FLIGHT 17","FLIGHT 18","Pénalités","TOTAL","Classement","np1","np2","np3","np4","np5","np6","np7","Intitulé","Désignation"]
[1,"Equipage 1",{"$f":"IF(COUNTIF($B$34:$K$35,B3)=1,HLOOKUP(B3,$B$34:$K$35,2,FALSE),IF(COUNTIF($B$36:$K$37,B3)=1,HLOOKUP(B3,$B$36:$K$37,2,FALSE)))","v":0},{"$f":"IF(COUNTIF($B$42:$K$43,B3)=1,HLOOKUP(B3,$B$42:$K$43,2,FALSE),IF(COUNTIF($B$44:$K$45,B3)=1,HLOOKUP(B3,$B$44:$K$45,2,FALSE),HLOOKUP(B3,#REF!,2,FALSE)))","v":0},{"$f":"IF(COUNTIF($B$50:$K$51,B3)=1,HLOOKUP(B3,$B$50:$K$51,2,FALSE),IF(COUNTIF($B$52:$K$53,B3)=1,HLOOKUP(B3,$B$52:$K$53,2,FALSE),HLOOKUP(B3,#REF!,2,FALSE)))","v":0},{"$f":"IF(COUNTIF($B$58:$K$59,B3)=1,HLOOKUP(B3,$B$58:$K$59,2,FALSE),IF(COUNTIF($B$60:$K$61,B3)=1,HLOOKUP(B3,$B$60:$K$61,2,FALSE),HLOOKUP(B3,#REF!,2,FALSE)))","v":0},{"$f":"IF(COUNTIF($B$66:$K$67,B3)=1,HLOOKUP(B3,$B$66:$K$67,2,FALSE),IF(COUNTIF($B$68:$K$69,B3)=1,HLOOKUP(B3,$B$68:$K$69,2,FALSE),HLOOKUP(B3,#REF!,2,FALSE)))","v":0},{"$f":"IF(COUNTIF($B$74:$K$75,B3)=1,HLOOKUP(B3,$B$74:$K$75,2,FALSE),IF(COUNTIF($B$76:$K$77,B3)=1,HLOOKUP(B3,$B$76:$K$77,2,FALSE),HLOOKUP(B3,#REF!,2,FALSE)))","v":0},{"$f":"IF(COUNTIF($B$82:$K$83,B3)=1,HLOOKUP(B3,$B$82:$K$83,2,FALSE),IF(COUNTIF($B$84:$K$85,B3)=1,HLOOKUP(B3,$B$84:$K$85,2,FALSE),HLOOKUP(B3,#REF!,2,FALSE)))","v":0},{"$f":"IF(COUNTIF($B$90:$K$91,B3)=1,HLOOKUP(B3,$B$90:$K$91,2,FALSE),IF(COUNTIF($B$92:$K$93,B3)=1,HLOOKUP(B3,$B$92:$K$93,2,FALSE),HLOOKUP(B3,#REF!,2,FALSE)))","v":0},{"$f":"IF(COUNTIF($B$98:$K$99,B3)=1,HLOOKUP(B3,$B$98:$K$99,2,FALSE),IF(COUNTIF($B$100:$K$101,B3)=1,HLOOKUP(B3,$B$100:$K$101,2,FALSE),HLOOKUP(B3,#REF!,2,FALSE)))","v":0},{"$f":"IF(COUNTIF($B$106:$K$107,B3)=1,HLOOKUP(B3,$B$106:$K$107,2,FALSE),IF(COUNTIF($B$108:$K$109,B3)=1,HLOOKUP(B3,$B$108:$K$109,2,FALSE),HLOOKUP(B3,#REF!,2,FALSE)))","v":0},{"$f":"IF(COUNTIF($B$114:$K$115,B3)=1,HLOOKUP(B3,$B$114:$K$115,2,FALSE),IF(COUNTIF($B$116:$K$117,B3)=1,HLOOKUP(B3,$B$116:$K$117,2,FALSE),HLOOKUP(B3,#REF!,2,FALSE)))","v":0},{"$f":"IF(COUNTIF($B$122:$K$123,B3)=1,HLOOKUP(B3,$B$122:$K$123,2,FALSE),IF(COUNTIF($B$124:$K$125,B3)=1,HLOOKUP(B3,$B$124:$K$125,2,FALSE),HLOOKUP(B3,#REF!,2,FALSE)))","v":0},{"$f":"IF(COUNTIF($B$130:$K$131,B3)=1,HLOOKUP(B3,$B$130:$K$131,2,FALSE),IF(COUNTIF($B$132:$K$133,B3)=1,HLOOKUP(B3,$B$132:$K$133,2,FALSE),HLOOKUP(B3,#REF!,2,FALSE)))","v":0},{"$f":"IF(COUNTIF($B$138:$K$139,B3)=1,HLOOKUP(B3,$B$138:$K$139,2,FALSE),IF(COUNTIF($B$140:$K$141,B3)=1,HLOOKUP(B3,$B$140:$K$141,2,FALSE),HLOOKUP(B3,#REF!,2,FALSE)))","v":0},{"$f":"IF(COUNTIF($B$146:$K$147,B3)=1,HLOOKUP(B3,$B$146:$K$147,2,FALSE),IF(COUNTIF($B$148:$K$149,B3)=1,HLOOKUP(B3,$B$148:$K$149,2,FALSE),HLOOKUP(B3,#REF!,2,FALSE)))","v":0},{"$f":"IF(COUNTIF($B$154:$K$155,B3)=1,HLOOKUP(B3,$B$154:$K$155,2,FALSE),IF(COUNTIF($B$156:$K$157,B3)=1,HLOOKUP(B3,$B$156:$K$157,2,FALSE),HLOOKUP(B3,$B$158:$K$159,2,FALSE)))","v":0},{"$f":"IF(COUNTIF($B$160:$K$161,B3)=1,HLOOKUP(B3,$B$160:$K$161,2,FALSE),IF(COUNTIF($B$162:$K$163,B3)=1,HLOOKUP(B3,$B$162:$K$163,2,FALSE)))","v":0},{"$f":"IF(COUNTIF($B$166:$K$167,B3)=1,HLOOKUP(B3,$B$166:$K$167,2,FALSE),IF(COUNTIF($B$168:$K$169,B3)=1,HLOOKUP(B3,$B$168:$K$169,2,FALSE)))","v":0},null,{"$f":"SUM(C3:U3)","v":0},{"$f":"IF(V3=SMALL(V$3:V$12,1),\"1\",IF(V3=SMALL(V$3:V$12,2),\"2\",IF(V3=SMALL(V$3:V$12,3),\"3\",IF(V3=SMALL(V$3:V$12,4),\"4\",IF(V3=SMALL(V$3:V$12,5),\"5\",IF(V3=SMALL(V$3:V$12,6),\"6\",IF(V3=SMALL(V$3:V$12,7),\"7\",IF(V3=SMALL(V$3:V$12,8),\"8\",IF(V3=SMALL(V$3:V$12,9),\"9\",IF(V3=SMALL(V$3:V$12,10),\"10\",IF(V3=SMALL(V$3:V$12,11),\"11\",IF(V3=SMALL(V$3:V$12,12),\"12\",IF(V3=SMALL(V$3:V$12,13),\"13\",IF(V3=SMALL(V$3:V$12,14),\"14\",IF(V3=SMALL(V$3:V$12,15),\"15\",IF(V3=SMALL(V$3:V$12,16),\"16\",IF(V3=SMALL(V$3:V$12,17),\"17\",IF(V3=SMALL(V$3:V$12,18),\"18\",IF(V3=SMALL(V$3:V$12,19),\"19\",IF(V3=SMALL(V$3:V$12,20),\"20\",IF(V3=SMALL(V$3:V$12,21),\"21\",IF(V3=SMALL(V$3:V$12,22),\"22\",IF(V3=SMALL(V$3:V$12,23),\"23\",IF(V3=SMALL(V$3:V$12,24),\"24\",IF(V3=SMALL(V$3:V$12,25),\"25\",IF(V3=SMALL(V$3:V$12,26),\"26\",IF(V3=SMALL(V$3:V$12,27),\"27\",IF(V3=SMALL(V$3:V$12,28),\"28\",IF(V3=SMALL(V$3:V$12,29),\"29\",IF(V3=SMALL(V$3:V$12,30),\"30\",IF(V3=SMALL(V$3:V$12,31),\"31\",IF(V3=SMALL(V$3:V$12,32),\"32\",IF(V3=SMALL(V$3:V$12,33),\"33\",IF(V3=SMALL(V$3:V$12,34),\"34\"))))))))))))))))))))))))))))))))))","v":"1"},{"$f":"COUNTIF($C3:$R3,X$1)","v":0},{"$f":"COUNTIF($C3:$R3,Y$1)","v":0},{"$f":"COUNTIF($C3:$R3,Z$1)","v":0},{"$f":"COUNTIF($C3:$R3,AA$1)","v":0},{"$f":"COUNTIF($C3:$R3,AB$1)","v":0},{"$f":"COUNTIF($C3:$R3,AC$1)","v":0},{"$f":"COUNTIF($C3:$R3,AD$1)","v":0},"Boat 1"]
[2,"Equipage 2",{"$f":"IF(COUNTIF($B$34:$K$35,B4)=1,HLOOKUP(B4,$B$34:$K$35,2,FALSE),IF(COUNTIF($B$36:$K$37,B4)=1,HLOOKUP(B4,$B$36:$K$37,2,FALSE),HLOOKUP(B4,#REF!,2,FALSE)))","v":0},{"$f":"IF(COUNTIF($B$42:$K$43,B4)=1,HLOOKUP(B4,$B$42:$K$43,2,FALSE),IF(COUNTIF($B$44:$K$45,B4)=1,HLOOKUP(B4,$B$44:$K$45,2,FALSE),HLOOKUP(B4,#REF!,2,FALSE)))","v":0},{"$f":"IF(COUNTIF($B$50:$K$51,B4)=1,HLOOKUP(B4,$B$50:$K$51,2,FALSE),IF(COUNTIF($B$52:$K$53,B4)=1,HLOOKUP(B4,$B$52:$K$53,2,FALSE),HLOOKUP(B4,#REF!,2,FALSE)))","v":0},{"$f":"IF(COUNTIF($B$58:$K$59,B4)=1,HLOOKUP(B4,$B$58:$K$59,2,FALSE),IF(COUNTIF($B$60:$K$61,B4)=1,HLOOKUP(B4,$B$60:$K$61,2,FALSE),HLOOKUP(B4,#REF!,2,FALSE)))","v":0},{"$f":"IF(COUNTIF($B$66:$K$67,B4)=1,HLOOKUP(B4,$B$66:$K$67,2,FALSE),IF(COUNTIF($B$68:$K$69,B4)=1,HLOOKUP(B4,$B$68:$K$69,2,FALSE),HLOOKUP(B4,#REF!,2,FALSE)))","v":0},{"$f":"IF(COUNTIF($B$74:$K$75,B4)=1,HLOOKUP(B4,$B$74:$K$75,2,FALSE),IF(COUNTIF($B$76:$K$77,B4)=1,HLOOKUP(B4,$B$76:$K$77,2,FALSE),HLOOKUP(B4,#REF!,2,FALSE)))","v":0},{"$f":"IF(COUNTIF($B$82:$K$83,B4)=1,HLOOKUP(B4,$B$82:$K$83,2,FALSE),IF(COUNTIF($B$84:$K$85,B4)=1,HLOOKUP(B4,$B$84:$K$85,2,FALSE),HLOOKUP(B4,#REF!,2,FALSE)))","v":0},{"$f":"IF(COUNTIF($B$90:$K$91,B4)=1,HLOOKUP(B4,$B$90:$K$91,2,FALSE),IF(COUNTIF($B$92:$K$93,B4)=1,HLOOKUP(B4,$B$92:$K$93,2,FALSE),HLOOKUP(B4,#REF!,2,FALSE)))","v":0},{"$f":"IF(COUNTIF($B$98:$K$99,B4)=1,HLOOKUP(B4,$B$98:$K$99,2,FALSE),IF(COUNTIF($B$100:$K$101,B4)=1,HLOOKUP(B4,$B$100:$K$101,2,FALSE),HLOOKUP(B4,#REF!,2,FALSE)))","v":0},{"$f":"IF(COUNTIF($B$106:$K$107,B4)=1,HLOOKUP(B4,$B$106:$K$107,2,FALSE),IF(COUNTIF($B$108:$K$109,B4)=1,HLOOKUP(B4,$B$108:$K$109,2,FALSE),HLOOKUP(B4,#REF!,2,FALSE)))","v":0},{"$f":"IF(COUNTIF($B$114:$K$115,B4)=1,HLOOKUP(B4,$B$114:$K$115,2,FALSE),IF(COUNTIF($B$116:$K$117,B4)=1,HLOOKUP(B4,$B$116:$K$117,2,FALSE),HLOOKUP(B4,#REF!,2,FALSE)))","v":0},{"$f":"IF(COUNTIF($B$122:$K$123,B4)=1,HLOOKUP(B4,$B$122:$K$123,2,FALSE),IF(COUNTIF($B$124:$K$125,B4)=1,HLOOKUP(B4,$B$124:$K$125,2,FALSE),HLOOKUP(B4,#REF!,2,FALSE)))","v":0},{"$f":"IF(COUNTIF($B$130:$K$131,B4)=1,HLOOKUP(B4,$B$130:$K$131,2,FALSE),IF(COUNTIF($B$132:$K$133,B4)=1,HLOOKUP(B4,$B$132:$K$133,2,FALSE),HLOOKUP(B4,#REF!,2,FALSE)))","v":0},{"$f":"IF(COUNTIF($B$138:$K$139,B4)=1,HLOOKUP(B4,$B$138:$K$139,2,FALSE),IF(COUNTIF($B$140:$K$141,B4)=1,HLOOKUP(B4,$B$140:$K$141,2,FALSE),HLOOKUP(B4,#REF!,2,FALSE)))","v":0},{"$f":"IF(COUNTIF($B$146:$K$147,B4)=1,HLOOKUP(B4,$B$146:$K$147,2,FALSE),IF(COUNTIF($B$148:$K$149,B4)=1,HLOOKUP(B4,$B$148:$K$149,2,FALSE),HLOOKUP(B4,#REF!,2,FALSE)))","v":0},{"$f":"IF(COUNTIF($B$154:$K$155,B4)=1,HLOOKUP(B4,$B$154:$K$155,2,FALSE),IF(COUNTIF($B$156:$K$157,B4)=1,HLOOKUP(B4,$B$156:$K$157,2,FALSE),HLOOKUP(B4,$B$158:$K$159,2,FALSE)))","v":0},{"$f":"IF(COUNTIF($B$160:$K$161,B4)=1,HLOOKUP(B4,$B$160:$K$161,2,FALSE),IF(COUNTIF($B$162:$K$163,B4)=1,HLOOKUP(B4,$B$162:$K$163,2,FALSE)))","v":0},{"$f":"IF(COUNTIF($B$166:$K$167,B4)=1,HLOOKUP(B4,$B$166:$K$167,2,FALSE),IF(COUNTIF($B$168:$K$169,B4)=1,HLOOKUP(B4,$B$168:$K$169,2,FALSE)))","v":0},null,{"$f":"SUM(C4:U4)","v":0},{"$f":"IF(V4=SMALL(V$3:V$12,1),\"1\",IF(V4=SMALL(V$3:V$12,2),\"2\",IF(V4=SMALL(V$3:V$12,3),\"3\",IF(V4=SMALL(V$3:V$12,4),\"4\",IF(V4=SMALL(V$3:V$12,5),\"5\",IF(V4=SMALL(V$3:V$12,6),\"6\",IF(V4=SMALL(V$3:V$12,7),\"7\",IF(V4=SMALL(V$3:V$12,8),\"8\",IF(V4=SMALL(V$3:V$12,9),\"9\",IF(V4=SMALL(V$3:V$12,10),\"10\",IF(V4=SMALL(V$3:V$12,11),\"11\",IF(V4=SMALL(V$3:V$12,12),\"12\",IF(V4=SMALL(V$3:V$12,13),\"13\",IF(V4=SMALL(V$3:V$12,14),\"14\",IF(V4=SMALL(V$3:V$12,15),\"15\",IF(V4=SMALL(V$3:V$12,16),\"16\",IF(V4=SMALL(V$3:V$12,17),\"17\",IF(V4=SMALL(V$3:V$12,18),\"18\",IF(V4=SMALL(V$3:V$12,19),\"19\",IF(V4=SMALL(V$3:V$12,20),\"20\",IF(V4=SMALL(V$3:V$12,21),\"21\",IF(V4=SMALL(V$3:V$12,22),\"22\",IF(V4=SMALL(V$3:V$12,23),\"23\",IF(V4=SMALL(V$3:V$12,24),\"24\",IF(V4=SMALL(V$3:V$12,25),\"25\",IF(V4=SMALL(V$3:V$12,26),\"26\",IF(V4=SMALL(V$3:V$12,27),\"27\",IF(V4=SMALL(V$3:V$12,28),\"28\",IF(V4=SMALL(V$3:V$12,29),\"29\",IF(V4=SMALL(V$3:V$12,30),\"30\",IF(V4=SMALL(V$3:V$12,31),\"31\",IF(V4=SMALL(V$3:V$12,32),\"32\",IF(V4=SMALL(V$3:V$12,33),\"33\",IF(V4=SMALL(V$3:V$12,34),\"34\"))))))))))))))))))))))))))))))))))","v":"1"},{"$f":"COUNTIF($C4:$R4,X$1)","v":0},{"$f":"COUNTIF($C4:$R4,Y$1)","v":0},{"$f":"COUNTIF($C4:$R4,Z$1)","v":0},{"$f":"COUNTIF($C4:$R4,AA$1)","v":0},{"$f":"COUNTIF($C4:$R4,AB$1)","v":0},{"$f":"COUNTIF($C4:$R4,AC$1)","v":0},0,"Boat 2"]
[3,"Equipage 3",{"$f":"IF(COUNTIF($B$34:$K$35,B5)=1,HLOOKUP(B5,$B$34:$K$35,2,FALSE),IF(COUNTIF($B$36:$K$37,B5)=1,HLOOKUP(B5,$B$36:$K$37,2,FALSE),HLOOKUP(B5,#REF!,2,FALSE)))","v":0},{"$f":"IF(COUNTIF($B$42:$K$43,B5)=1,HLOOKUP(B5,$B$42:$K$43,2,FALSE),IF(COUNTIF($B$44:$K$45,B5)=1,HLOOKUP(B5,$B$44:$K$45,2,FALSE),HLOOKUP(B5,#REF!,2,FALSE)))","v":0},{"$f":"IF(COUNTIF($B$50:$K$51,B5)=1,HLOOKUP(B5,$B$50:$K$51,2,FALSE),IF(COUNTIF($B$52:$K$53,B5)=1,HLOOKUP(B5,$B$52:$K$53,2,FALSE),HLOOKUP(B5,#REF!,2,FALSE)))","v":0},{"$f":"IF(COUNTIF($B$58:$K$59,B5)=1,HLOOKUP(B5,$B$58:$K$59,2,FALSE),IF(COUNTIF($B$60:$K$61,B5)=1,HLOOKUP(B5,$B$60:$K$61,2,FALSE),HLOOKUP(B5,#REF!,2,FALSE)))","v":0},{"$f":"IF(COUNTIF($B$66:$K$67,B5)=1,HLOOKUP(B5,$B$66:$K$67,2,FALSE),IF(COUNTIF($B$68:$K$69,B5)=1,HLOOKUP(B5,$B$68:$K$69,2,FALSE),HLOOKUP(B5,#REF!,2,FALSE)))","v":0},{"$f":"IF(COUNTIF($B$74:$K$75,B5)=1,HLOOKUP(B5,$B$74:$K$75,2,FALSE),IF(COUNTIF($B$76:$K$77,B5)=1,HLOOKUP(B5,$B$76:$K$77,2,FALSE),HLOOKUP(B5,#REF!,2,FALSE)))","v":0},{"$f":"IF(COUNTIF($B$82:$K$83,B5)=1,HLOOKUP(B5,$B$82:$K$83,2,FALSE),IF(COUNTIF($B$84:$K$85,B5)=1,HLOOKUP(B5,$B$84:$K$85,2,FALSE),HLOOKUP(B5,#REF!,2,FALSE)))","v":0},{"$f":"IF(COUNTIF($B$90:$K$91,B5)=1,HLOOKUP(B5,$B$90:$K$91,2,FALSE),IF(COUNTIF($B$92:$K$93,B5)=1,HLOOKUP(B5,$B$92:$K$93,2,FALSE),HLOOKUP(B5,#REF!,2,FALSE)))","v":0},{"$f":"IF(COUNTIF($B$98:$K$99,B5)=1,HLOOKUP(B5,$B$98:$K$99,2,FALSE),IF(COUNTIF($B$100:$K$101,B5)=1,HLOOKUP(B5,$B$100:$K$101,2,FALSE),HLOOKUP(B5,#REF!,2,FALSE)))","v":0},{"$f":"IF(COUNTIF($B$106:$K$107,B5)=1,HLOOKUP(B5,$B$106:$K$107,2,FALSE),IF(COUNTIF($B$108:$K$109,B5)=1,HLOOKUP(B5,$B$108:$K$109,2,FALSE),HLOOKUP(B5,#REF!,2,FALSE)))","v":0},{"$f":"IF(COUNTIF($B$114:$K$115,B5)=1,HLOOKUP(B5,$B$114:$K$115,2,FALSE),IF(COUNTIF($B$116:$K$117,B5)=1,HLOOKUP(B5,$B$116:$K$117,2,FALSE),HLOOKUP(B5,#REF!,2,FALSE)))","v":0},{"$f":"IF(COUNTIF($B$122:$K$123,B5)=1,HLOOKUP(B5,$B$122:$K$123,2,FALSE),IF(COUNTIF($B$124:$K$125,B5)=1,HLOOKUP(B5,$B$124:$K$125,2,FALSE),HLOOKUP(B5,#REF!,2,FALSE)))","v":0},{"$f":"IF(COUNTIF($B$130:$K$131,B5)=1,HLOOKUP(B5,$B$130:$K$131,2,FALSE),IF(COUNTIF($B$132:$K$133,B5)=1,HLOOKUP(B5,$B$132:$K$133,2,FALSE),HLOOKUP(B5,#REF!,2,FALSE)))","v":0},{"$f":"IF(COUNTIF($B$138:$K$139,B5)=1,HLOOKUP(B5,$B$138:$K$139,2,FALSE),IF(COUNTIF($B$140:$K$141,B5)=1,HLOOKUP(B5,$B$140:$K$141,2,FALSE),HLOOKUP(B5,#REF!,2,FALSE)))","v":0},{"$f":"IF(COUNTIF($B$146:$K$147,B5)=1,HLOOKUP(B5,$B$146:$K$147,2,FALSE),IF(COUNTIF($B$148:$K$149,B5)=1,HLOOKUP(B5,$B$148:$K$149,2,FALSE),HLOOKUP(B5,#REF!,2,FALSE)))","v":0},{"$f":"IF(COUNTIF($B$154:$K$155,B5)=1,HLOOKUP(B5,$B$154:$K$155,2,FALSE),IF(COUNTIF($B$156:$K$157,B5)=1,HLOOKUP(B5,$B$156:$K$157,2,FALSE),HLOOKUP(B5,$B$158:$K$159,2,FALSE)))","v":0},{"$f":"IF(COUNTIF($B$160:$K$161,B5)=1,HLOOKUP(B5,$B$160:$K$161,2,FALSE),IF(COUNTIF($B$162:$K$163,B5)=1,HLOOKUP(B5,$B$162:$K$163,2,FALSE)))","v":0},0,null,{"$f":"SUM(C5:U5)","v":0},{"$f":"IF(V5=SMALL(V$3:V$12,1),\"1\",IF(V5=SMALL(V$3:V$12,2),\"2\",IF(V5=SMALL(V$3:V$12,3),\"3\",IF(V5=SMALL(V$3:V$12,4),\"4\",IF(V5=SMALL(V$3:V$12,5),\"5\",IF(V5=SMALL(V$3:V$12,6),\"6\",IF(V5=SMALL(V$3:V$12,7),\"7\",IF(V5=SMALL(V$3:V$12,8),\"8\",IF(V5=SMALL(V$3:V$12,9),\"9\",IF(V5=SMALL(V$3:V$12,10),\"10\",IF(V5=SMALL(V$3:V$12,11),\"11\",IF(V5=SMALL(V$3:V$12,12),\"12\",IF(V5=SMALL(V$3:V$12,13),\"13\",IF(V5=SMALL(V$3:V$12,14),\"14\",IF(V5=SMALL(V$3:V$12,15),\"15\",IF(V5=SMALL(V$3:V$12,16),\"16\",IF(V5=SMALL(V$3:V$12,17),\"17\",IF(V5=SMALL(V$3:V$12,18),\"18\",IF(V5=SMALL(V$3:V$12,19),\"19\",IF(V5=SMALL(V$3:V$12,20),\"20\",IF(V5=SMALL(V$3:V$12,21),\"21\",IF(V5=SMALL(V$3:V$12,22),\"22\",IF(V5=SMALL(V$3:V$12,23),\"23\",IF(V5=SMALL(V$3:V$12,24),\"24\",IF(V5=SMALL(V$3:V$12,25),\"25\",IF(V5=SMALL(V$3:V$12,26),\"26\",IF(V5=SMALL(V$3:V$12,27),\"27\",IF(V5=SMALL(V$3:V$12,28),\"28\",IF(V5=SMALL(V$3:V$12,29),\"29\",IF(V5=SMALL(V$3:V$12,30),\"30\",IF(V5=SMALL(V$3:V$12,31),\"31\",IF(V5=SMALL(V$3:V$12,32),\"32\",IF(V5=SMALL(V$3:V$12,33),\"33\",IF(V5=SMALL(V$3:V$12,34),\"34\"))))))))))))))))))))))))))))))))))","v":"1"},{"$f":"COUNTIF($C5:$R5,X$1)","v":0},{"$f":"COUNTIF($C5:$R5,Y$1)","v":0},{"$f":"COUNTIF($C5:$R5,Z$1)","v":0},{"$f":"COUNTIF($C5:$R5,AA$1)","v":0},{"$f":"COUNTIF($C5:$R5,AB$1)","v":0},{"$f":"COUNTIF($C5:$R5,AC$1)","v":0},0,"Boat 3"]
[4,"Equipage 4",{"$f":"IF(COUNTIF($B$34:$K$35,B6)=1,HLOOKUP(B6,$B$34:$K$35,2,FALSE),IF(COUNTIF($B$36:$K$37,B6)=1,HLOOKUP(B6,$B$36:$K$37,2,FALSE),HLOOKUP(B6,#REF!,2,FALSE)))","v":0},{"$f":"IF(COUNTIF($B$42:$K$43,B6)=1,HLOOKUP(B6,$B$42:$K$43,2,FALSE),IF(COUNTIF($B$44:$K$45,B6)=1,HLOOKUP(B6,$B$44:$K$45,2,FALSE),HLOOKUP(B6,#REF!,2,FALSE)))","v":0},{"$f":"IF(COUNTIF($B$50:$K$51,B6)=1,HLOOKUP(B6,$B$50:$K$51,2,FALSE),IF(COUNTIF($B$52:$K$53,B6)=1,HLOOKUP(B6,$B$52:$K$53,2,FALSE),HLOOKUP(B6,#REF!,2,FALSE)))","v":0},{"$f":"IF(COUNTIF($B$58:$K$59,B6)=1,HLOOKUP(B6,$B$58:$K$59,2,FALSE),IF(COUNTIF($B$60:$K$61,B6)=1,HLOOKUP(B6,$B$60:$K$61,2,FALSE),HLOOKUP(B6,#REF!,2,FALSE)))","v":0},{"$f":"IF(COUNTIF($B$66:$K$67,B6)=1,HLOOKUP(B6,$B$66:$K$67,2,FALSE),IF(COUNTIF($B$68:$K$69,B6)=1,HLOOKUP(B6,$B$68:$K$69,2,FALSE),HLOOKUP(B6,#REF!,2,FALSE)))","v":0},{"$f":"IF(COUNTIF($B$74:$K$75,B6)=1,HLOOKUP(B6,$B$74:$K$75,2,FALSE),IF(COUNTIF($B$76:$K$77,B6)=1,HLOOKUP(B6,$B$76:$K$77,2,FALSE),HLOOKUP(B6,#REF!,2,FALSE)))","v":0},{"$f":"IF(COUNTIF($B$82:$K$83,B6)=1,HLOOKUP(B6,$B$82:$K$83,2,FALSE),IF(COUNTIF($B$84:$K$85,B6)=1,HLOOKUP(B6,$B$84:$K$85,2,FALSE),HLOOKUP(B6,#REF!,2,FALSE)))","v":0},{"$f":"IF(COUNTIF($B$90:$K$91,B6)=1,HLOOKUP(B6,$B$90:$K$91,2,FALSE),IF(COUNTIF($B$92:$K$93,B6)=1,HLOOKUP(B6,$B$92:$K$93,2,FALSE),HLOOKUP(B6,#REF!,2,FALSE)))","v":0},{"$f":"IF(COUNTIF($B$98:$K$99,B6)=1,HLOOKUP(B6,$B$98:$K$99,2,FALSE),IF(COUNTIF($B$100:$K$101,B6)=1,HLOOKUP(B6,$B$100:$K$101,2,FALSE),HLOOKUP(B6,#REF!,2,FALSE)))","v":0},{"$f":"IF(COUNTIF($B$106:$K$107,B6)=1,HLOOKUP(B6,$B$106:$K$107,2,FALSE),IF(COUNTIF($B$108:$K$109,B6)=1,HLOOKUP(B6,$B$108:$K$109,2,FALSE),HLOOKUP(B6,#REF!,2,FALSE)))","v":0},{"$f":"IF(COUNTIF($B$114:$K$115,B6)=1,HLOOKUP(B6,$B$114:$K$115,2,FALSE),IF(COUNTIF($B$116:$K$117,B6)=1,HLOOKUP(B6,$B$116:$K$117,2,FALSE),HLOOKUP(B6,#REF!,2,FALSE)))","v":0},{"$f":"IF(COUNTIF($B$122:$K$123,B6)=1,HLOOKUP(B6,$B$122:$K$123,2,FALSE),IF(COUNTIF($B$124:$K$125,B6)=1,HLOOKUP(B6,$B$124:$K$125,2,FALSE),HLOOKUP(B6,#REF!,2,FALSE)))","v":0},{"$f":"IF(COUNTIF($B$130:$K$131,B6)=1,HLOOKUP(B6,$B$130:$K$131,2,FALSE),IF(COUNTIF($B$132:$K$133,B6)=1,HLOOKUP(B6,$B$132:$K$133,2,FALSE),HLOOKUP(B6,#REF!,2,FALSE)))","v":0},{"$f":"IF(COUNTIF($B$138:$K$139,B6)=1,HLOOKUP(B6,$B$138:$K$139,2,FALSE),IF(COUNTIF($B$140:$K$141,B6)=1,HLOOKUP(B6,$B$140:$K$141,2,FALSE),HLOOKUP(B6,#REF!,2,FALSE)))","v":0},{"$f":"IF(COUNTIF($B$146:$K$147,B6)=1,HLOOKUP(B6,$B$146:$K$147,2,FALSE),IF(COUNTIF($B$148:$K$149,B6)=1,HLOOKUP(B6,$B$148:$K$149,2,FALSE),HLOOKUP(B6,#REF!,2,FALSE)))","v":0},{"$f":"IF(COUNTIF($B$154:$K$155,B6)=1,HLOOKUP(B6,$B$154:$K$155,2,FALSE),IF(COUNTIF($B$156:$K$157,B6)=1,HLOOKUP(B6,$B$156:$K$157,2,FALSE),HLOOKUP(B6,$B$158:$K$159,2,FALSE)))","v":0},{"$f":"IF(COUNTIF($B$160:$K$161,B6)=1,HLOOKUP(B6,$B$160:$K$161,2,FALSE),IF(COUNTIF($B$162:$K$163,B6)=1,HLOOKUP(B6,$B$162:$K$163,2,FALSE)))","v":0},0,null,{"$f":"SUM(C6:U6)","v":0},{"$f":"IF(V6=SMALL(V$3:V$12,1),\"1\",IF(V6=SMALL(V$3:V$12,2),\"2\",IF(V6=SMALL(V$3:V$12,3),\"3\",IF(V6=SMALL(V$3:V$12,4),\"4\",IF(V6=SMALL(V$3:V$12,5),\"5\",IF(V6=SMALL(V$3:V$12,6),\"6\",IF(V6=SMALL(V$3:V$12,7),\"7\",IF(V6=SMALL(V$3:V$12,8),\"8\",IF(V6=SMALL(V$3:V$12,9),\"9\",IF(V6=SMALL(V$3:V$12,10),\"10\",IF(V6=SMALL(V$3:V$12,11),\"11\",IF(V6=SMALL(V$3:V$12,12),\"12\",IF(V6=SMALL(V$3:V$12,13),\"13\",IF(V6=SMALL(V$3:V$12,14),\"14\",IF(V6=SMALL(V$3:V$12,15),\"15\",IF(V6=SMALL(V$3:V$12,16),\"16\",IF(V6=SMALL(V$3:V$12,17),\"17\",IF(V6=SMALL(V$3:V$12,18),\"18\",IF(V6=SMALL(V$3:V$12,19),\"19\",IF(V6=SMALL(V$3:V$12,20),\"20\",IF(V6=SMALL(V$3:V$12,21),\"21\",IF(V6=SMALL(V$3:V$12,22),\"22\",IF(V6=SMALL(V$3:V$12,23),\"23\",IF(V6=SMALL(V$3:V$12,24),\"24\",IF(V6=SMALL(V$3:V$12,25),\"25\",IF(V6=SMALL(V$3:V$12,26),\"26\",IF(V6=SMALL(V$3:V$12,27),\"27\",IF(V6=SMALL(V$3:V$12,28),\"28\",IF(V6=SMALL(V$3:V$12,29),\"29\",IF(V6=SMALL(V$3:V$12,30),\"30\",IF(V6=SMALL(V$3:V$12,31),\"31\",IF(V6=SMALL(V$3:V$12,32),\"32\",IF(V6=SMALL(V$3:V$12,33),\"33\",IF(V6=SMALL(V$3:V$12,34),\"34\"))))))))))))))))))))))))))))))))))","v":"1"},{"$f":"COUNTIF($C6:$R6,X$1)","v":0},{"$f":"COUNTIF($C6:$R6,Y$1)","v":0},{"$f":"COUNTIF($C6:$R6,Z$1)","v":0},{"$f":"COUNTIF($C6:$R6,AA$1)","v":0},{"$f":"COUNTIF($C6:$R6,AB$1)","v":0},{"$f":"COUNTIF($C6:$R6,AC$1)","v":0},0,"Boat 4"]
[5,"Equipage 5",{"$f":"IF(COUNTIF($B$34:$K$35,B7)=1,HLOOKUP(B7,$B$34:$K$35,2,FALSE),IF(COUNTIF($B$36:$K$37,B7)=1,HLOOKUP(B7,$B$36:$K$37,2,FALSE),HLOOKUP(B7,#REF!,2,FALSE)))","v":0},{"$f":"IF(COUNTIF($B$42:$K$43,B7)=1,HLOOKUP(B7,$B$42:$K$43,2,FALSE),IF(COUNTIF($B$44:$K$45,B7)=1,HLOOKUP(B7,$B$44:$K$45,2,FALSE),HLOOKUP(B7,#REF!,2,FALSE)))","v":0},{"$f":"IF(COUNTIF($B$50:$K$51,B7)=1,HLOOKUP(B7,$B$50:$K$51,2,FALSE),IF(COUNTIF($B$52:$K$53,B7)=1,HLOOKUP(B7,$B$52:$K$53,2,FALSE),HLOOKUP(B7,#REF!,2,FALSE)))","v":0},{"$f":"IF(COUNTIF($B$58:$K$59,B7)=1,HLOOKUP(B7,$B$58:$K$59,2,FALSE),IF(COUNTIF($B$60:$K$61,B7)=1,HLOOKUP(B7,$B$60:$K$61,2,FALSE),HLOOKUP(B7,#REF!,2,FALSE)))","v":0},{"$f":"IF(COUNTIF($B$66:$K$67,B7)=1,HLOOKUP(B7,$B$66:$K$67,2,FALSE),IF(COUNTIF($B$68:$K$69,B7)=1,HLOOKUP(B7,$B$68:$K$69,2,FALSE),HLOOKUP(B7,#REF!,2,FALSE)))","v":0},{"$f":"IF(COUNTIF($B$74:$K$75,B7)=1,HLOOKUP(B7,$B$74:$K$75,2,FALSE),IF(COUNTIF($B$76:$K$77,B7)=1,HLOOKUP(B7,$B$76:$K$77,2,FALSE),HLOOKUP(B7,#REF!,2,FALSE)))","v":0},{"$f":"IF(COUNTIF($B$82:$K$83,B7)=1,HLOOKUP(B7,$B$82:$K$83,2,FALSE),IF(COUNTIF($B$84:$K$85,B7)=1,HLOOKUP(B7,$B$84:$K$85,2,FALSE),HLOOKUP(B7,#REF!,2,FALSE)))","v":0},{"$f":"IF(COUNTIF($B$90:$K$91,B7)=1,HLOOKUP(B7,$B$90:$K$91,2,FALSE),IF(COUNTIF($B$92:$K$93,B7)=1,HLOOKUP(B7,$B$92:$K$93,2,FALSE),HLOOKUP(B7,#REF!,2,FALSE)))","v":0},{"$f":"IF(COUNTIF($B$98:$K$99,B7)=1,HLOOKUP(B7,$B$98:$K$99,2,FALSE),IF(COUNTIF($B$100:$K$101,B7)=1,HLOOKUP(B7,$B$100:$K$101,2,FALSE),HLOOKUP(B7,#REF!,2,FALSE)))","v":0},{"$f":"IF(COUNTIF($B$106:$K$107,B7)=1,HLOOKUP(B7,$B$106:$K$107,2,FALSE),IF(COUNTIF($B$108:$K$109,B7)=1,HLOOKUP(B7,$B$108:$K$109,2,FALSE),HLOOKUP(B7,#REF!,2,FALSE)))","v":0},{"$f":"IF(COUNTIF($B$114:$K$115,B7)=1,HLOOKUP(B7,$B$114:$K$115,2,FALSE),IF(COUNTIF($B$116:$K$117,B7)=1,HLOOKUP(B7,$B$116:$K$117,2,FALSE),HLOOKUP(B7,#REF!,2,FALSE)))","v":0},{"$f":"IF(COUNTIF($B$122:$K$123,B7)=1,HLOOKUP(B7,$B$122:$K$123,2,FALSE),IF(COUNTIF($B$124:$K$125,B7)=1,HLOOKUP(B7,$B$124:$K$125,2,FALSE),HLOOKUP(B7,#REF!,2,FALSE)))","v":0},{"$f":"IF(COUNTIF($B$130:$K$131,B7)=1,HLOOKUP(B7,$B$130:$K$131,2,FALSE),IF(COUNTIF($B$132:$K$133,B7)=1,HLOOKUP(B7,$B$132:$K$133,2,FALSE),HLOOKUP(B7,#REF!,2,FALSE)))","v":0},{"$f":"IF(COUNTIF($B$138:$K$139,B7)=1,HLOOKUP(B7,$B$138:$K$139,2,FALSE),IF(COUNTIF($B$140:$K$141,B7)=1,HLOOKUP(B7,$B$140:$K$141,2,FALSE),HLOOKUP(B7,#REF!,2,FALSE)))","v":0},{"$f":"IF(COUNTIF($B$146:$K$147,B7)=1,HLOOKUP(B7,$B$146:$K$147,2,FALSE),IF(COUNTIF($B$148:$K$149,B7)=1,HLOOKUP(B7,$B$148:$K$149,2,FALSE),HLOOKUP(B7,#REF!,2,FALSE)))","v":0},{"$f":"IF(COUNTIF($B$154:$K$155,B7)=1,HLOOKUP(B7,$B$154:$K$155,2,FALSE),IF(COUNTIF($B$156:$K$157,B7)=1,HLOOKUP(B7,$B$156:$K$157,2,FALSE),HLOOKUP(B7,$B$158:$K$159,2,FALSE)))","v":0},{"$f":"IF(COUNTIF($B$160:$K$161,B7)=1,HLOOKUP(B7,$B$160:$K$161,2,FALSE),IF(COUNTIF($B$162:$K$163,B7)=1,HLOOKUP(B7,$B$162:$K$163,2,FALSE)))","v":0},0,null,{"$f":"SUM(C7:U7)","v":0},{"$f":"IF(V7=SMALL(V$3:V$12,1),\"1\",IF(V7=SMALL(V$3:V$12,2),\"2\",IF(V7=SMALL(V$3:V$12,3),\"3\",IF(V7=SMALL(V$3:V$12,4),\"4\",IF(V7=SMALL(V$3:V$12,5),\"5\",IF(V7=SMALL(V$3:V$12,6),\"6\",IF(V7=SMALL(V$3:V$12,7),\"7\",IF(V7=SMALL(V$3:V$12,8),\"8\",IF(V7=SMALL(V$3:V$12,9),\"9\",IF(V7=SMALL(V$3:V$12,10),\"10\",IF(V7=SMALL(V$3:V$12,11),\"11\",IF(V7=SMALL(V$3:V$12,12),\"12\",IF(V7=SMALL(V$3:V$12,13),\"13\",IF(V7=SMALL(V$3:V$12,14),\"14\",IF(V7=SMALL(V$3:V$12,15),\"15\",IF(V7=SMALL(V$3:V$12,16),\"16\",IF(V7=SMALL(V$3:V$12,17),\"17\",IF(V7=SMALL(V$3:V$12,18),\"18\",IF(V7=SMALL(V$3:V$12,19),\"19\",IF(V7=SMALL(V$3:V$12,20),\"20\",IF(V7=SMALL(V$3:V$12,21),\"21\",IF(V7=SMALL(V$3:V$12,22),\"22\",IF(V7=SMALL(V$3:V$12,23),\"23\",IF(V7=SMALL(V$3:V$12,24),\"24\",IF(V7=SMALL(V$3:V$12,25),\"25\",IF(V7=SMALL(V$3:V$12,26),\"26\",IF(V7=SMALL(V$3:V$12,27),\"27\",IF(V7=SMALL(V$3:V$12,28),\"28\",IF(V7=SMALL(V$3:V$12,29),\"29\",IF(V7=SMALL(V$3:V$12,30),\"30\",IF(V7=SMALL(V$3:V$12,31),\"31\",IF(V7=SMALL(V$3:V$12,32),\"32\",IF(V7=SMALL(V$3:V$12,33),\"33\",IF(V7=SMALL(V$3:V$12,34),\"34\"))))))))))))))))))))))))))))))))))","v":"1"},{"$f":"COUNTIF($C7:$R7,X$1)","v":0},{"$f":"COUNTIF($C7:$R7,Y$1)","v":0},{"$f":"COUNTIF($C7:$R7,Z$1)","v":0},{"$f":"COUNTIF($C7:$R7,AA$1)","v":0},{"$f":"COUNTIF($C7:$R7,AB$1)","v":0},{"$f":"COUNTIF($C7:$R7,AC$1)","v":0},0,"Boat 5"]
[6,"Equipage 6",{"$f":"IF(COUNTIF($B$34:$K$35,B8)=1,HLOOKUP(B8,$B$34:$K$35,2,FALSE),IF(COUNTIF($B$36:$K$37,B8)=1,HLOOKUP(B8,$B$36:$K$37,2,FALSE),HLOOKUP(B8,#REF!,2,FALSE)))","v":0},{"$f":"IF(COUNTIF($B$42:$K$43,B8)=1,HLOOKUP(B8,$B$42:$K$43,2,FALSE),IF(COUNTIF($B$44:$K$45,B8)=1,HLOOKUP(B8,$B$44:$K$45,2,FALSE),HLOOKUP(B8,#REF!,2,FALSE)))","v":0},{"$f":"IF(COUNTIF($B$50:$K$51,B8)=1,HLOOKUP(B8,$B$50:$K$51,2,FALSE),IF(COUNTIF($B$52:$K$53,B8)=1,HLOOKUP(B8,$B$52:$K$53,2,FALSE),HLOOKUP(B8,#REF!,2,FALSE)))","v":0},{"$f":"IF(COUNTIF($B$58:$K$59,B8)=1,HLOOKUP(B8,$B$58:$K$59,2,FALSE),IF(COUNTIF($B$60:$K$61,B8)=1,HLOOKUP(B8,$B$60:$K$61,2,FALSE),HLOOKUP(B8,#REF!,2,FALSE)))","v":0},{"$f":"IF(COUNTIF($B$66:$K$67,B8)=1,HLOOKUP(B8,$B$66:$K$67,2,FALSE),IF(COUNTIF($B$68:$K$69,B8)=1,HLOOKUP(B8,$B$68:$K$69,2,FALSE),HLOOKUP(B8,#REF!,2,FALSE)))","v":0},{"$f":"IF(COUNTIF($B$74:$K$75,B8)=1,HLOOKUP(B8,$B$74:$K$75,2,FALSE),IF(COUNTIF($B$76:$K$77,B8)=1,HLOOKUP(B8,$B$76:$K$77,2,FALSE),HLOOKUP(B8,#REF!,2,FALSE)))","v":0},{"$f":"IF(COUNTIF($B$82:$K$83,B8)=1,HLOOKUP(B8,$B$82:$K$83,2,FALSE),IF(COUNTIF($B$84:$K$85,B8)=1,HLOOKUP(B8,$B$84:$K$85,2,FALSE),HLOOKUP(B8,#REF!,2,FALSE)))","v":0},{"$f":"IF(COUNTIF($B$90:$K$91,B8)=1,HLOOKUP(B8,$B$90:$K$91,2,FALSE),IF(COUNTIF($B$92:$K$93,B8)=1,HLOOKUP(B8,$B$92:$K$93,2,FALSE),HLOOKUP(B8,#REF!,2,FALSE)))","v":0},{"$f":"IF(COUNTIF($B$98:$K$99,B8)=1,HLOOKUP(B8,$B$98:$K$99,2,FALSE),IF(COUNTIF($B$100:$K$101,B8)=1,HLOOKUP(B8,$B$100:$K$101,2,FALSE),HLOOKUP(B8,#REF!,2,FALSE)))","v":0},{"$f":"IF(COUNTIF($B$106:$K$107,B8)=1,HLOOKUP(B8,$B$106:$K$107,2,FALSE),IF(COUNTIF($B$108:$K$109,B8)=1,HLOOKUP(B8,$B$108:$K$109,2,FALSE),HLOOKUP(B8,#REF!,2,FALSE)))","v":0},{"$f":"IF(COUNTIF($B$114:$K$115,B8)=1,HLOOKUP(B8,$B$114:$K$115,2,FALSE),IF(COUNTIF($B$116:$K$117,B8)=1,HLOOKUP(B8,$B$116:$K$117,2,FALSE),HLOOKUP(B8,#REF!,2,FALSE)))","v":0},{"$f":"IF(COUNTIF($B$122:$K$123,B8)=1,HLOOKUP(B8,$B$122:$K$123,2,FALSE),IF(COUNTIF($B$124:$K$125,B8)=1,HLOOKUP(B8,$B$124:$K$125,2,FALSE),HLOOKUP(B8,#REF!,2,FALSE)))","v":0},{"$f":"IF(COUNTIF($B$130:$K$131,B8)=1,HLOOKUP(B8,$B$130:$K$131,2,FALSE),IF(COUNTIF($B$132:$K$133,B8)=1,HLOOKUP(B8,$B$132:$K$133,2,FALSE),HLOOKUP(B8,#REF!,2,FALSE)))","v":0},{"$f":"IF(COUNTIF($B$138:$K$139,B8)=1,HLOOKUP(B8,$B$138:$K$139,2,FALSE),IF(COUNTIF($B$140:$K$141,B8)=1,HLOOKUP(B8,$B$140:$K$141,2,FALSE),HLOOKUP(B8,#REF!,2,FALSE)))","v":0},{"$f":"IF(COUNTIF($B$146:$K$147,B8)=1,HLOOKUP(B8,$B$146:$K$147,2,FALSE),IF(COUNTIF($B$148:$K$149,B8)=1,HLOOKUP(B8,$B$148:$K$149,2,FALSE),HLOOKUP(B8,#REF!,2,FALSE)))","v":0},{"$f":"IF(COUNTIF($B$154:$K$155,B8)=1,HLOOKUP(B8,$B$154:$K$155,2,FALSE),IF(COUNTIF($B$156:$K$157,B8)=1,HLOOKUP(B8,$B$156:$K$157,2,FALSE),HLOOKUP(B8,$B$158:$K$159,2,FALSE)))","v":0},{"$f":"IF(COUNTIF($B$160:$K$161,B8)=1,HLOOKUP(B8,$B$160:$K$161,2,FALSE),IF(COUNTIF($B$162:$K$163,B8)=1,HLOOKUP(B8,$B$162:$K$163,2,FALSE)))","v":0},0,null,{"$f":"SUM(C8:U8)","v":0},{"$f":"IF(V8=SMALL(V$3:V$12,1),\"1\",IF(V8=SMALL(V$3:V$12,2),\"2\",IF(V8=SMALL(V$3:V$12,3),\"3\",IF(V8=SMALL(V$3:V$12,4),\"4\",IF(V8=SMALL(V$3:V$12,5),\"5\",IF(V8=SMALL(V$3:V$12,6),\"6\",IF(V8=SMALL(V$3:V$12,7),\"7\",IF(V8=SMALL(V$3:V$12,8),\"8\",IF(V8=SMALL(V$3:V$12,9),\"9\",IF(V8=SMALL(V$3:V$12,10),\"10\",IF(V8=SMALL(V$3:V$12,11),\"11\",IF(V8=SMALL(V$3:V$12,12),\"12\",IF(V8=SMALL(V$3:V$12,13),\"13\",IF(V8=SMALL(V$3:V$12,14),\"14\",IF(V8=SMALL(V$3:V$12,15),\"15\",IF(V8=SMALL(V$3:V$12,16),\"16\",IF(V8=SMALL(V$3:V$12,17),\"17\",IF(V8=SMALL(V$3:V$12,18),\"18\",IF(V8=SMALL(V$3:V$12,19),\"19\",IF(V8=SMALL(V$3:V$12,20),\"20\",IF(V8=SMALL(V$3:V$12,21),\"21\",IF(V8=SMALL(V$3:V$12,22),\"22\",IF(V8=SMALL(V$3:V$12,23),\"23\",IF(V8=SMALL(V$3:V$12,24),\"24\",IF(V8=SMALL(V$3:V$12,25),\"25\",IF(V8=SMALL(V$3:V$12,26),\"26\",IF(V8=SMALL(V$3:V$12,27),\"27\",IF(V8=SMALL(V$3:V$12,28),\"28\",IF(V8=SMALL(V$3:V$12,29),\"29\",IF(V8=SMALL(V$3:V$12,30),\"30\",IF(V8=SMALL(V$3:V$12,31),\"31\",IF(V8=SMALL(V$3:V$12,32),\"32\",IF(V8=SMALL(V$3:V$12,33),\"33\",IF(V8=SMALL(V$3:V$12,34),\"34\"))))))))))))))))))))))))))))))))))","v":"1"},{"$f":"COUNTIF($C8:$R8,X$1)","v":0},{"$f":"COUNTIF($C8:$R8,Y$1)","v":0},{"$f":"COUNTIF($C8:$R8,Z$1)","v":0},{"$f":"COUNTIF($C8:$R8,AA$1)","v":0},{"$f":"COUNTIF($C8:$R8,AB$1)","v":0},{"$f":"COUNTIF($C8:$R8,AC$1)","v":0},0,"Boat 6"]
[7,"Equipage 7",{"$f":"IF(COUNTIF($B$34:$K$35,B9)=1,HLOOKUP(B9,$B$34:$K$35,2,FALSE),IF(COUNTIF($B$36:$K$37,B9)=1,HLOOKUP(B9,$B$36:$K$37,2,FALSE),HLOOKUP(B9,#REF!,2,FALSE)))","v":0},{"$f":"IF(COUNTIF($B$42:$K$43,B9)=1,HLOOKUP(B9,$B$42:$K$43,2,FALSE),IF(COUNTIF($B$44:$K$45,B9)=1,HLOOKUP(B9,$B$44:$K$45,2,FALSE),HLOOKUP(B9,#REF!,2,FALSE)))","v":0},{"$f":"IF(COUNTIF($B$50:$K$51,B9)=1,HLOOKUP(B9,$B$50:$K$51,2,FALSE),IF(COUNTIF($B$52:$K$53,B9)=1,HLOOKUP(B9,$B$52:$K$53,2,FALSE),HLOOKUP(B9,#REF!,2,FALSE)))","v":0},{"$f":"IF(COUNTIF($B$58:$K$59,B9)=1,HLOOKUP(B9,$B$58:$K$59,2,FALSE),IF(COUNTIF($B$60:$K$61,B9)=1,HLOOKUP(B9,$B$60:$K$61,2,FALSE),HLOOKUP(B9,#REF!,2,FALSE)))","v":0},{"$f":"IF(COUNTIF($B$66:$K$67,B9)=1,HLOOKUP(B9,$B$66:$K$67,2,FALSE),IF(COUNTIF($B$68:$K$69,B9)=1,HLOOKUP(B9,$B$68:$K$69,2,FALSE),HLOOKUP(B9,#REF!,2,FALSE)))","v":0},{"$f":"IF(COUNTIF($B$74:$K$75,B9)=1,HLOOKUP(B9,$B$74:$K$75,2,FALSE),IF(COUNTIF($B$76:$K$77,B9)=1,HLOOKUP(B9,$B$76:$K$77,2,FALSE),HLOOKUP(B9,#REF!,2,FALSE)))","v":0},{"$f":"IF(COUNTIF($B$82:$K$83,B9)=1,HLOOKUP(B9,$B$82:$K$83,2,FALSE),IF(COUNTIF($B$84:$K$85,B9)=1,HLOOKUP(B9,$B$84:$K$85,2,FALSE),HLOOKUP(B9,#REF!,2,FALSE)))","v":0},{"$f":"IF(COUNTIF($B$90:$K$91,B9)=1,HLOOKUP(B9,$B$90:$K$91,2,FALSE),IF(COUNTIF($B$92:$K$93,B9)=1,HLOOKUP(B9,$B$92:$K$93,2,FALSE),HLOOKUP(B9,#REF!,2,FALSE)))","v":0},{"$f":"IF(COUNTIF($B$98:$K$99,B9)=1,HLOOKUP(B9,$B$98:$K$99,2,FALSE),IF(COUNTIF($B$100:$K$101,B9)=1,HLOOKUP(B9,$B$100:$K$101,2,FALSE),HLOOKUP(B9,#REF!,2,FALSE)))","v":0},{"$f":"IF(COUNTIF($B$106:$K$107,B9)=1,HLOOKUP(B9,$B$106:$K$107,2,FALSE),IF(COUNTIF($B$108:$K$109,B9)=1,HLOOKUP(B9,$B$108:$K$109,2,FALSE),HLOOKUP(B9,#REF!,2,FALSE)))","v":0},{"$f":"IF(COUNTIF($B$114:$K$115,B9)=1,HLOOKUP(B9,$B$114:$K$115,2,FALSE),IF(COUNTIF($B$116:$K$117,B9)=1,HLOOKUP(B9,$B$116:$K$117,2,FALSE),HLOOKUP(B9,#REF!,2,FALSE)))","v":0},{"$f":"IF(COUNTIF($B$122:$K$123,B9)=1,HLOOKUP(B9,$B$122:$K$123,2,FALSE),IF(COUNTIF($B$124:$K$125,B9)=1,HLOOKUP(B9,$B$124:$K$125,2,FALSE),HLOOKUP(B9,#REF!,2,FALSE)))","v":0},{"$f":"IF(COUNTIF($B$130:$K$131,B9)=1,HLOOKUP(B9,$B$130:$K$131,2,FALSE),IF(COUNTIF($B$132:$K$133,B9)=1,HLOOKUP(B9,$B$132:$K$133,2,FALSE),HLOOKUP(B9,#REF!,2,FALSE)))","v":0},{"$f":"IF(COUNTIF($B$138:$K$139,B9)=1,HLOOKUP(B9,$B$138:$K$139,2,FALSE),IF(COUNTIF($B$140:$K$141,B9)=1,HLOOKUP(B9,$B$140:$K$141,2,FALSE),HLOOKUP(B9,#REF!,2,FALSE)))","v":0},{"$f":"IF(COUNTIF($B$146:$K$147,B9)=1,HLOOKUP(B9,$B$146:$K$147,2,FALSE),IF(COUNTIF($B$148:$K$149,B9)=1,HLOOKUP(B9,$B$148:$K$149,2,FALSE),HLOOKUP(B9,#REF!,2,FALSE)))","v":0},{"$f":"IF(COUNTIF($B$154:$K$155,B9)=1,HLOOKUP(B9,$B$154:$K$155,2,FALSE),IF(COUNTIF($B$156:$K$157,B9)=1,HLOOKUP(B9,$B$156:$K$157,2,FALSE),HLOOKUP(B9,$B$158:$K$159,2,FALSE)))","v":0},{"$f":"IF(COUNTIF($B$160:$K$161,B9)=1,HLOOKUP(B9,$B$160:$K$161,2,FALSE),IF(COUNTIF($B$162:$K$163,B9)=1,HLOOKUP(B9,$B$162:$K$163,2,FALSE)))","v":0},0,null,{"$f":"SUM(C9:U9)","v":0},{"$f":"IF(V9=SMALL(V$3:V$12,1),\"1\",IF(V9=SMALL(V$3:V$12,2),\"2\",IF(V9=SMALL(V$3:V$12,3),\"3\",IF(V9=SMALL(V$3:V$12,4),\"4\",IF(V9=SMALL(V$3:V$12,5),\"5\",IF(V9=SMALL(V$3:V$12,6),\"6\",IF(V9=SMALL(V$3:V$12,7),\"7\",IF(V9=SMALL(V$3:V$12,8),\"8\",IF(V9=SMALL(V$3:V$12,9),\"9\",IF(V9=SMALL(V$3:V$12,10),\"10\",IF(V9=SMALL(V$3:V$12,11),\"11\",IF(V9=SMALL(V$3:V$12,12),\"12\",IF(V9=SMALL(V$3:V$12,13),\"13\",IF(V9=SMALL(V$3:V$12,14),\"14\",IF(V9=SMALL(V$3:V$12,15),\"15\",IF(V9=SMALL(V$3:V$12,16),\"16\",IF(V9=SMALL(V$3:V$12,17),\"17\",IF(V9=SMALL(V$3:V$12,18),\"18\",IF(V9=SMALL(V$3:V$12,19),\"19\",IF(V9=SMALL(V$3:V$12,20),\"20\",IF(V9=SMALL(V$3:V$12,21),\"21\",IF(V9=SMALL(V$3:V$12,22),\"22\",IF(V9=SMALL(V$3:V$12,23),\"23\",IF(V9=SMALL(V$3:V$12,24),\"24\",IF(V9=SMALL(V$3:V$12,25),\"25\",IF(V9=SMALL(V$3:V$12,26),\"26\",IF(V9=SMALL(V$3:V$12,27),\"27\",IF(V9=SMALL(V$3:V$12,28),\"28\",IF(V9=SMALL(V$3:V$12,29),\"29\",IF(V9=SMALL(V$3:V$12,30),\"30\",IF(V9=SMALL(V$3:V$12,31),\"31\",IF(V9=SMALL(V$3:V$12,32),\"32\",IF(V9=SMALL(V$3:V$12,33),\"33\",IF(V9=SMALL(V$3:V$12,34),\"34\"))))))))))))))))))))))))))))))))))","v":"1"},{"$f":"COUNTIF($C9:$R9,X$1)","v":0},{"$f":"COUNTIF($C9:$R9,Y$1)","v":0},{"$f":"COUNTIF($C9:$R9,Z$1)","v":0},{"$f":"COUNTIF($C9:$R9,AA$1)","v":0},{"$f":"COUNTIF($C9:$R9,AB$1)","v":0},{"$f":"COUNTIF($C9:$R9,AC$1)","v":0},0,"Boat 8"]
[8,"Equipage 8",{"$f":"IF(COUNTIF($B$34:$K$35,B10)=1,HLOOKUP(B10,$B$34:$K$35,2,FALSE),IF(COUNTIF($B$36:$K$37,B10)=1,HLOOKUP(B10,$B$36:$K$37,2,FALSE),HLOOKUP(B10,#REF!,2,FALSE)))","v":0},{"$f":"IF(COUNTIF($B$42:$K$43,B10)=1,HLOOKUP(B10,$B$42:$K$43,2,FALSE),IF(COUNTIF($B$44:$K$45,B10)=1,HLOOKUP(B10,$B$44:$K$45,2,FALSE),HLOOKUP(B10,#REF!,2,FALSE)))","v":0},{"$f":"IF(COUNTIF($B$50:$K$51,B10)=1,HLOOKUP(B10,$B$50:$K$51,2,FALSE),IF(COUNTIF($B$52:$K$53,B10)=1,HLOOKUP(B10,$B$52:$K$53,2,FALSE),HLOOKUP(B10,#REF!,2,FALSE)))","v":0},{"$f":"IF(COUNTIF($B$58:$K$59,B10)=1,HLOOKUP(B10,$B$58:$K$59,2,FALSE),IF(COUNTIF($B$60:$K$61,B10)=1,HLOOKUP(B10,$B$60:$K$61,2,FALSE),HLOOKUP(B10,#REF!,2,FALSE)))","v":0},{"$f":"IF(COUNTIF($B$66:$K$67,B10)=1,HLOOKUP(B10,$B$66:$K$67,2,FALSE),IF(COUNTIF($B$68:$K$69,B10)=1,HLOOKUP(B10,$B$68:$K$69,2,FALSE),HLOOKUP(B10,#REF!,2,FALSE)))","v":0},{"$f":"IF(COUNTIF($B$74:$K$75,B10)=1,HLOOKUP(B10,$B$74:$K$75,2,FALSE),IF(COUNTIF($B$76:$K$77,B10)=1,HLOOKUP(B10,$B$76:$K$77,2,FALSE),HLOOKUP(B10,#REF!,2,FALSE)))","v":0},{"$f":"IF(COUNTIF($B$82:$K$83,B10)=1,HLOOKUP(B10,$B$82:$K$83,2,FALSE),IF(COUNTIF($B$84:$K$85,B10)=1,HLOOKUP(B10,$B$84:$K$85,2,FALSE),HLOOKUP(B10,#REF!,2,FALSE)))","v":0},{"$f":"IF(COUNTIF($B$90:$K$91,B10)=1,HLOOKUP(B10,$B$90:$K$91,2,FALSE),IF(COUNTIF($B$92:$K$93,B10)=1,HLOOKUP(B10,$B$92:$K$93,2,FALSE),HLOOKUP(B10,#REF!,2,FALSE)))","v":0},{"$f":"IF(COUNTIF($B$98:$K$99,B10)=1,HLOOKUP(B10,$B$98:$K$99,2,FALSE),IF(COUNTIF($B$100:$K$101,B10)=1,HLOOKUP(B10,$B$100:$K$101,2,FALSE),HLOOKUP(B10,#REF!,2,FALSE)))","v":0},{"$f":"IF(COUNTIF($B$106:$K$107,B10)=1,HLOOKUP(B10,$B$106:$K$107,2,FALSE),IF(COUNTIF($B$108:$K$109,B10)=1,HLOOKUP(B10,$B$108:$K$109,2,FALSE),HLOOKUP(B10,#REF!,2,FALSE)))","v":0},{"$f":"IF(COUNTIF($B$114:$K$115,B10)=1,HLOOKUP(B10,$B$114:$K$115,2,FALSE),IF(COUNTIF($B$116:$K$117,B10)=1,HLOOKUP(B10,$B$116:$K$117,2,FALSE),HLOOKUP(B10,#REF!,2,FALSE)))","v":0},{"$f":"IF(COUNTIF($B$122:$K$123,B10)=1,HLOOKUP(B10,$B$122:$K$123,2,FALSE),IF(COUNTIF($B$124:$K$125,B10)=1,HLOOKUP(B10,$B$124:$K$125,2,FALSE),HLOOKUP(B10,#REF!,2,FALSE)))","v":0},{"$f":"IF(COUNTIF($B$130:$K$131,B10)=1,HLOOKUP(B10,$B$130:$K$131,2,FALSE),IF(COUNTIF($B$132:$K$133,B10)=1,HLOOKUP(B10,$B$132:$K$133,2,FALSE),HLOOKUP(B10,#REF!,2,FALSE)))","v":0},{"$f":"IF(COUNTIF($B$138:$K$139,B10)=1,HLOOKUP(B10,$B$138:$K$139,2,FALSE),IF(COUNTIF($B$140:$K$141,B10)=1,HLOOKUP(B10,$B$140:$K$141,2,FALSE),HLOOKUP(B10,#REF!,2,FALSE)))","v":0},{"$f":"IF(COUNTIF($B$146:$K$147,B10)=1,HLOOKUP(B10,$B$146:$K$147,2,FALSE),IF(COUNTIF($B$148:$K$149,B10)=1,HLOOKUP(B10,$B$148:$K$149,2,FALSE),HLOOKUP(B10,#REF!,2,FALSE)))","v":0},{"$f":"IF(COUNTIF($B$154:$K$155,B10)=1,HLOOKUP(B10,$B$154:$K$155,2,FALSE),IF(COUNTIF($B$156:$K$157,B10)=1,HLOOKUP(B10,$B$156:$K$157,2,FALSE),HLOOKUP(B10,$B$158:$K$159,2,FALSE)))","v":0},{"$f":"IF(COUNTIF($B$160:$K$161,B10)=1,HLOOKUP(B10,$B$160:$K$161,2,FALSE),IF(COUNTIF($B$162:$K$163,B10)=1,HLOOKUP(B10,$B$162:$K$163,2,FALSE)))","v":0},0,null,{"$f":"SUM(C10:U10)","v":0},{"$f":"IF(V10=SMALL(V$3:V$12,1),\"1\",IF(V10=SMALL(V$3:V$12,2),\"2\",IF(V10=SMALL(V$3:V$12,3),\"3\",IF(V10=SMALL(V$3:V$12,4),\"4\",IF(V10=SMALL(V$3:V$12,5),\"5\",IF(V10=SMALL(V$3:V$12,6),\"6\",IF(V10=SMALL(V$3:V$12,7),\"7\",IF(V10=SMALL(V$3:V$12,8),\"8\",IF(V10=SMALL(V$3:V$12,9),\"9\",IF(V10=SMALL(V$3:V$12,10),\"10\",IF(V10=SMALL(V$3:V$12,11),\"11\",IF(V10=SMALL(V$3:V$12,12),\"12\",IF(V10=SMALL(V$3:V$12,13),\"13\",IF(V10=SMALL(V$3:V$12,14),\"14\",IF(V10=SMALL(V$3:V$12,15),\"15\",IF(V10=SMALL(V$3:V$12,16),\"16\",IF(V10=SMALL(V$3:V$12,17),\"17\",IF(V10=SMALL(V$3:V$12,18),\"18\",IF(V10=SMALL(V$3:V$12,19),\"19\",IF(V10=SMALL(V$3:V$12,20),\"20\",IF(V10=SMALL(V$3:V$12,21),\"21\",IF(V10=SMALL(V$3:V$12,22),\"22\",IF(V10=SMALL(V$3:V$12,23),\"23\",IF(V10=SMALL(V$3:V$12,24),\"24\",IF(V10=SMALL(V$3:V$12,25),\"25\",IF(V10=SMALL(V$3:V$12,26),\"26\",IF(V10=SMALL(V$3:V$12,27),\"27\",IF(V10=SMALL(V$3:V$12,28),\"28\",IF(V10=SMALL(V$3:V$12,29),\"29\",IF(V10=SMALL(V$3:V$12,30),\"30\",IF(V10=SMALL(V$3:V$12,31),\"31\",IF(V10=SMALL(V$3:V$12,32),\"32\",IF(V10=SMALL(V$3:V$12,33),\"33\",IF(V10=SMALL(V$3:V$12,34),\"34\"))))))))))))))))))))))))))))))))))","v":"1"},{"$f":"COUNTIF($C10:$R10,X$1)","v":0},{"$f":"COUNTIF($C10:$R10,Y$1)","v":0},{"$f":"COUNTIF($C10:$R10,Z$1)","v":0},{"$f":"COUNTIF($C10:$R10,AA$1)","v":0},{"$f":"COUNTIF($C10:$R10,AB$1)","v":0},{"$f":"COUNTIF($C10:$R10,AC$1)","v":0},0,"Boat 9"]
[9,"Equipage 9",{"$f":"IF(COUNTIF($B$34:$K$35,B11)=1,HLOOKUP(B11,$B$34:$K$35,2,FALSE),IF(COUNTIF($B$36:$K$37,B11)=1,HLOOKUP(B11,$B$36:$K$37,2,FALSE),HLOOKUP(B11,#REF!,2,FALSE)))","v":0},{"$f":"IF(COUNTIF($B$42:$K$43,B11)=1,HLOOKUP(B11,$B$42:$K$43,2,FALSE),IF(COUNTIF($B$44:$K$45,B11)=1,HLOOKUP(B11,$B$44:$K$45,2,FALSE),HLOOKUP(B11,#REF!,2,FALSE)))","v":0},{"$f":"IF(COUNTIF($B$50:$K$51,B11)=1,HLOOKUP(B11,$B$50:$K$51,2,FALSE),IF(COUNTIF($B$52:$K$53,B11)=1,HLOOKUP(B11,$B$52:$K$53,2,FALSE),HLOOKUP(B11,#REF!,2,FALSE)))","v":0},{"$f":"IF(COUNTIF($B$58:$K$59,B11)=1,HLOOKUP(B11,$B$58:$K$59,2,FALSE),IF(COUNTIF($B$60:$K$61,B11)=1,HLOOKUP(B11,$B$60:$K$61,2,FALSE),HLOOKUP(B11,#REF!,2,FALSE)))","v":0},{"$f":"IF(COUNTIF($B$66:$K$67,B11)=1,HLOOKUP(B11,$B$66:$K$67,2,FALSE),IF(COUNTIF($B$68:$K$69,B11)=1,HLOOKUP(B11,$B$68:$K$69,2,FALSE),HLOOKUP(B11,#REF!,2,FALSE)))","v":0},{"$f":"IF(COUNTIF($B$74:$K$75,B11)=1,HLOOKUP(B11,$B$74:$K$75,2,FALSE),IF(COUNTIF($B$76:$K$77,B11)=1,HLOOKUP(B11,$B$76:$K$77,2,FALSE),HLOOKUP(B11,#REF!,2,FALSE)))","v":0},{"$f":"IF(COUNTIF($B$82:$K$83,B11)=1,HLOOKUP(B11,$B$82:$K$83,2,FALSE),IF(COUNTIF($B$84:$K$85,B11)=1,HLOOKUP(B11,$B$84:$K$85,2,FALSE),HLOOKUP(B11,#REF!,2,FALSE)))","v":0},{"$f":"IF(COUNTIF($B$90:$K$91,B11)=1,HLOOKUP(B11,$B$90:$K$91,2,FALSE),IF(COUNTIF($B$92:$K$93,B11)=1,HLOOKUP(B11,$B$92:$K$93,2,FALSE),HLOOKUP(B11,#REF!,2,FALSE)))","v":0},{"$f":"IF(COUNTIF($B$98:$K$99,B11)=1,HLOOKUP(B11,$B$98:$K$99,2,FALSE),IF(COUNTIF($B$100:$K$101,B11)=1,HLOOKUP(B11,$B$100:$K$101,2,FALSE),HLOOKUP(B11,#REF!,2,FALSE)))","v":0},{"$f":"IF(COUNTIF($B$106:$K$107,B11)=1,HLOOKUP(B11,$B$106:$K$107,2,FALSE),IF(COUNTIF($B$108:$K$109,B11)=1,HLOOKUP(B11,$B$108:$K$109,2,FALSE),HLOOKUP(B11,#REF!,2,FALSE)))","v":0},{"$f":"IF(COUNTIF($B$114:$K$115,B11)=1,HLOOKUP(B11,$B$114:$K$115,2,FALSE),IF(COUNTIF($B$116:$K$117,B11)=1,HLOOKUP(B11,$B$116:$K$117,2,FALSE),HLOOKUP(B11,#REF!,2,FALSE)))","v":0},{"$f":"IF(COUNTIF($B$122:$K$123,B11)=1,HLOOKUP(B11,$B$122:$K$123,2,FALSE),IF(COUNTIF($B$124:$K$125,B11)=1,HLOOKUP(B11,$B$124:$K$125,2,FALSE),HLOOKUP(B11,#REF!,2,FALSE)))","v":0},{"$f":"IF(COUNTIF($B$130:$K$131,B11)=1,HLOOKUP(B11,$B$130:$K$131,2,FALSE),IF(COUNTIF($B$132:$K$133,B11)=1,HLOOKUP(B11,$B$132:$K$133,2,FALSE),HLOOKUP(B11,#REF!,2,FALSE)))","v":0},{"$f":"IF(COUNTIF($B$138:$K$139,B11)=1,HLOOKUP(B11,$B$138:$K$139,2,FALSE),IF(COUNTIF($B$140:$K$141,B11)=1,HLOOKUP(B11,$B$140:$K$141,2,FALSE),HLOOKUP(B11,#REF!,2,FALSE)))","v":0},{"$f":"IF(COUNTIF($B$146:$K$147,B11)=1,HLOOKUP(B11,$B$146:$K$147,2,FALSE),IF(COUNTIF($B$148:$K$149,B11)=1,HLOOKUP(B11,$B$148:$K$149,2,FALSE),HLOOKUP(B11,#REF!,2,FALSE)))","v":0},{"$f":"IF(COUNTIF($B$154:$K$155,B11)=1,HLOOKUP(B11,$B$154:$K$155,2,FALSE),IF(COUNTIF($B$156:$K$157,B11)=1,HLOOKUP(B11,$B$156:$K$157,2,FALSE),HLOOKUP(B11,$B$158:$K$159,2,FALSE)))","v":0},{"$f":"IF(COUNTIF($B$160:$K$161,B11)=1,HLOOKUP(B11,$B$160:$K$161,2,FALSE),IF(COUNTIF($B$162:$K$163,B11)=1,HLOOKUP(B11,$B$162:$K$163,2,FALSE)))","v":0},0,null,{"$f":"SUM(C11:U11)","v":0},{"$f":"IF(V11=SMALL(V$3:V$12,1),\"1\",IF(V11=SMALL(V$3:V$12,2),\"2\",IF(V11=SMALL(V$3:V$12,3),\"3\",IF(V11=SMALL(V$3:V$12,4),\"4\",IF(V11=SMALL(V$3:V$12,5),\"5\",IF(V11=SMALL(V$3:V$12,6),\"6\",IF(V11=SMALL(V$3:V$12,7),\"7\",IF(V11=SMALL(V$3:V$12,8),\"8\",IF(V11=SMALL(V$3:V$12,9),\"9\",IF(V11=SMALL(V$3:V$12,10),\"10\",IF(V11=SMALL(V$3:V$12,11),\"11\",IF(V11=SMALL(V$3:V$12,12),\"12\",IF(V11=SMALL(V$3:V$12,13),\"13\",IF(V11=SMALL(V$3:V$12,14),\"14\",IF(V11=SMALL(V$3:V$12,15),\"15\",IF(V11=SMALL(V$3:V$12,16),\"16\",IF(V11=SMALL(V$3:V$12,17),\"17\",IF(V11=SMALL(V$3:V$12,18),\"18\",IF(V11=SMALL(V$3:V$12,19),\"19\",IF(V11=SMALL(V$3:V$12,20),\"20\",IF(V11=SMALL(V$3:V$12,21),\"21\",IF(V11=SMALL(V$3:V$12,22),\"22\",IF(V11=SMALL(V$3:V$12,23),\"23\",IF(V11=SMALL(V$3:V$12,24),\"24\",IF(V11=SMALL(V$3:V$12,25),\"25\",IF(V11=SMALL(V$3:V$12,26),\"26\",IF(V11=SMALL(V$3:V$12,27),\"27\",IF(V11=SMALL(V$3:V$12,28),\"28\",IF(V11=SMALL(V$3:V$12,29),\"29\",IF(V11=SMALL(V$3:V$12,30),\"30\",IF(V11=SMALL(V$3:V$12,31),\"31\",IF(V11=SMALL(V$3:V$12,32),\"32\",IF(V11=SMALL(V$3:V$12,33),\"33\",IF(V11=SMALL(V$3:V$12,34),\"34\"))))))))))))))))))))))))))))))))))","v":"1"},{"$f":"COUNTIF($C11:$R11,X$1)","v":0},{"$f":"COUNTIF($C11:$R11,Y$1)","v":0},{"$f":"COUNTIF($C11:$R11,Z$1)","v":0},{"$f":"COUNTIF($C11:$R11,AA$1)","v":0},{"$f":"COUNTIF($C11:$R11,AB$1)","v":0},{"$f":"COUNTIF($C11:$R11,AC$1)","v":0},0,"Boat 10"]
[10,"Equipage 10",{"$f":"IF(COUNTIF($B$34:$K$35,B12)=1,HLOOKUP(B12,$B$34:$K$35,2,FALSE),IF(COUNTIF($B$36:$K$37,B12)=1,HLOOKUP(B12,$B$36:$K$37,2,FALSE),HLOOKUP(B12,#REF!,2,FALSE)))","v":0},{"$f":"IF(COUNTIF($B$42:$K$43,B12)=1,HLOOKUP(B12,$B$42:$K$43,2,FALSE),IF(COUNTIF($B$44:$K$45,B12)=1,HLOOKUP(B12,$B$44:$K$45,2,FALSE),HLOOKUP(B12,#REF!,2,FALSE)))","v":0},{"$f":"IF(COUNTIF($B$50:$K$51,B12)=1,HLOOKUP(B12,$B$50:$K$51,2,FALSE),IF(COUNTIF($B$52:$K$53,B12)=1,HLOOKUP(B12,$B$52:$K$53,2,FALSE),HLOOKUP(B12,#REF!,2,FALSE)))","v":0},{"$f":"IF(COUNTIF($B$58:$K$59,B12)=1,HLOOKUP(B12,$B$58:$K$59,2,FALSE),IF(COUNTIF($B$60:$K$61,B12)=1,HLOOKUP(B12,$B$60:$K$61,2,FALSE),HLOOKUP(B12,#REF!,2,FALSE)))","v":0},{"$f":"IF(COUNTIF($B$66:$K$67,B12)=1,HLOOKUP(B12,$B$66:$K$67,2,FALSE),IF(COUNTIF($B$68:$K$69,B12)=1,HLOOKUP(B12,$B$68:$K$69,2,FALSE),HLOOKUP(B12,#REF!,2,FALSE)))","v":0},{"$f":"IF(COUNTIF($B$74:$K$75,B12)=1,HLOOKUP(B12,$B$74:$K$75,2,FALSE),IF(COUNTIF($B$76:$K$77,B12)=1,HLOOKUP(B12,$B$76:$K$77,2,FALSE),HLOOKUP(B12,#REF!,2,FALSE)))","v":0},{"$f":"IF(COUNTIF($B$82:$K$83,B12)=1,HLOOKUP(B12,$B$82:$K$83,2,FALSE),IF(COUNTIF($B$84:$K$85,B12)=1,HLOOKUP(B12,$B$84:$K$85,2,FALSE),HLOOKUP(B12,#REF!,2,FALSE)))","v":0},{"$f":"IF(COUNTIF($B$90:$K$91,B12)=1,HLOOKUP(B12,$B$90:$K$91,2,FALSE),IF(COUNTIF($B$92:$K$93,B12)=1,HLOOKUP(B12,$B$92:$K$93,2,FALSE),HLOOKUP(B12,#REF!,2,FALSE)))","v":0},{"$f":"IF(COUNTIF($B$98:$K$99,B12)=1,HLOOKUP(B12,$B$98:$K$99,2,FALSE),IF(COUNTIF($B$100:$K$101,B12)=1,HLOOKUP(B12,$B$100:$K$101,2,FALSE),HLOOKUP(B12,#REF!,2,FALSE)))","v":0},{"$f":"IF(COUNTIF($B$106:$K$107,B12)=1,HLOOKUP(B12,$B$106:$K$107,2,FALSE),IF(COUNTIF($B$108:$K$109,B12)=1,HLOOKUP(B12,$B$108:$K$109,2,FALSE),HLOOKUP(B12,#REF!,2,FALSE)))","v":0},{"$f":"IF(COUNTIF($B$114:$K$115,B12)=1,HLOOKUP(B12,$B$114:$K$115,2,FALSE),IF(COUNTIF($B$116:$K$117,B12)=1,HLOOKUP(B12,$B$116:$K$117,2,FALSE),HLOOKUP(B12,#REF!,2,FALSE)))","v":0},{"$f":"IF(COUNTIF($B$122:$K$123,B12)=1,HLOOKUP(B12,$B$122:$K$123,2,FALSE),IF(COUNTIF($B$124:$K$125,B12)=1,HLOOKUP(B12,$B$124:$K$125,2,FALSE),HLOOKUP(B12,#REF!,2,FALSE)))","v":0},{"$f":"IF(COUNTIF($B$130:$K$131,B12)=1,HLOOKUP(B12,$B$130:$K$131,2,FALSE),IF(COUNTIF($B$132:$K$133,B12)=1,HLOOKUP(B12,$B$132:$K$133,2,FALSE),HLOOKUP(B12,#REF!,2,FALSE)))","v":0},{"$f":"IF(COUNTIF($B$138:$K$139,B12)=1,HLOOKUP(B12,$B$138:$K$139,2,FALSE),IF(COUNTIF($B$140:$K$141,B12)=1,HLOOKUP(B12,$B$140:$K$141,2,FALSE),HLOOKUP(B12,#REF!,2,FALSE)))","v":0},{"$f":"IF(COUNTIF($B$146:$K$147,B12)=1,HLOOKUP(B12,$B$146:$K$147,2,FALSE),IF(COUNTIF($B$148:$K$149,B12)=1,HLOOKUP(B12,$B$148:$K$149,2,FALSE),HLOOKUP(B12,#REF!,2,FALSE)))","v":0},{"$f":"IF(COUNTIF($B$154:$K$155,B12)=1,HLOOKUP(B12,$B$154:$K$155,2,FALSE),IF(COUNTIF($B$156:$K$157,B12)=1,HLOOKUP(B12,$B$156:$K$157,2,FALSE),HLOOKUP(B12,$B$158:$K$159,2,FALSE)))","v":0},{"$f":"IF(COUNTIF($B$160:$K$161,B12)=1,HLOOKUP(B12,$B$160:$K$161,2,FALSE),IF(COUNTIF($B$162:$K$163,B12)=1,HLOOKUP(B12,$B$162:$K$163,2,FALSE)))","v":0},0,null,{"$f":"SUM(C12:U12)","v":0},{"$f":"IF(V12=SMALL(V$3:V$12,1),\"1\",IF(V12=SMALL(V$3:V$12,2),\"2\",IF(V12=SMALL(V$3:V$12,3),\"3\",IF(V12=SMALL(V$3:V$12,4),\"4\",IF(V12=SMALL(V$3:V$12,5),\"5\",IF(V12=SMALL(V$3:V$12,6),\"6\",IF(V12=SMALL(V$3:V$12,7),\"7\",IF(V12=SMALL(V$3:V$12,8),\"8\",IF(V12=SMALL(V$3:V$12,9),\"9\",IF(V12=SMALL(V$3:V$12,10),\"10\",IF(V12=SMALL(V$3:V$12,11),\"11\",IF(V12=SMALL(V$3:V$12,12),\"12\",IF(V12=SMALL(V$3:V$12,13),\"13\",IF(V12=SMALL(V$3:V$12,14),\"14\",IF(V12=SMALL(V$3:V$12,15),\"15\",IF(V12=SMALL(V$3:V$12,16),\"16\",IF(V12=SMALL(V$3:V$12,17),\"17\",IF(V12=SMALL(V$3:V$12,18),\"18\",IF(V12=SMALL(V$3:V$12,19),\"19\",IF(V12=SMALL(V$3:V$12,20),\"20\",IF(V12=SMALL(V$3:V$12,21),\"21\",IF(V12=SMALL(V$3:V$12,22),\"22\",IF(V12=SMALL(V$3:V$12,23),\"23\",IF(V12=SMALL(V$3:V$12,24),\"24\",IF(V12=SMALL(V$3:V$12,25),\"25\",IF(V12=SMALL(V$3:V$12,26),\"26\",IF(V12=SMALL(V$3:V$12,27),\"27\",IF(V12=SMALL(V$3:V$12,28),\"28\",IF(V12=SMALL(V$3:V$12,29),\"29\",IF(V12=SMALL(V$3:V$12,30),\"30\",IF(V12=SMALL(V$3:V$12,31),\"31\",IF(V12=SMALL(V$3:V$12,32),\"32\",IF(V12=SMALL(V$3:V$12,33),\"33\",IF(V12=SMALL(V$3:V$12,34),\"34\"))))))))))))))))))))))))))))))))))","v":"1"},{"$f":"COUNTIF($C12:$R12,X$1)","v":0},{"$f":"COUNTIF($C12:$R12,Y$1)","v":0},{"$f":"COUNTIF($C12:$R12,Z$1)","v":0},{"$f":"COUNTIF($C12:$R12,AA$1)","v":0},{"$f":"COUNTIF($C12:$R12,AB$1)","v":0},{"$f":"COUNTIF($C12:$R12,AC$1)","v":0},0,"Boat 11"]
[13,"Equipage 13",{"$f":"IF(COUNTIF($B$34:$K$35,B13)=1,HLOOKUP(B13,$B$34:$K$35,2,FALSE),IF(COUNTIF($B$36:$K$37,B13)=1,HLOOKUP(B13,$B$36:$K$37,2,FALSE),HLOOKUP(B13,#REF!,2,FALSE)))","v":{"$error":"#REF!"}},{"$f":"IF(COUNTIF($B$42:$K$43,B13)=1,HLOOKUP(B13,$B$42:$K$43,2,FALSE),IF(COUNTIF($B$44:$K$45,B13)=1,HLOOKUP(B13,$B$44:$K$45,2,FALSE),HLOOKUP(B13,#REF!,2,FALSE)))","v":{"$error":"#REF!"}},{"$f":"IF(COUNTIF($B$50:$K$51,B13)=1,HLOOKUP(B13,$B$50:$K$51,2,FALSE),IF(COUNTIF($B$52:$K$53,B13)=1,HLOOKUP(B13,$B$52:$K$53,2,FALSE),HLOOKUP(B13,#REF!,2,FALSE)))","v":{"$error":"#REF!"}},{"$f":"IF(COUNTIF($B$58:$K$59,B13)=1,HLOOKUP(B13,$B$58:$K$59,2,FALSE),IF(COUNTIF($B$60:$K$61,B13)=1,HLOOKUP(B13,$B$60:$K$61,2,FALSE),HLOOKUP(B13,#REF!,2,FALSE)))","v":{"$error":"#REF!"}},{"$f":"IF(COUNTIF($B$66:$K$67,B13)=1,HLOOKUP(B13,$B$66:$K$67,2,FALSE),IF(COUNTIF($B$68:$K$69,B13)=1,HLOOKUP(B13,$B$68:$K$69,2,FALSE),HLOOKUP(B13,#REF!,2,FALSE)))","v":{"$error":"#REF!"}},{"$f":"IF(COUNTIF($B$74:$K$75,B13)=1,HLOOKUP(B13,$B$74:$K$75,2,FALSE),IF(COUNTIF($B$76:$K$77,B13)=1,HLOOKUP(B13,$B$76:$K$77,2,FALSE),HLOOKUP(B13,#REF!,2,FALSE)))","v":{"$error":"#REF!"}},{"$f":"IF(COUNTIF($B$82:$K$83,B13)=1,HLOOKUP(B13,$B$82:$K$83,2,FALSE),IF(COUNTIF($B$84:$K$85,B13)=1,HLOOKUP(B13,$B$84:$K$85,2,FALSE),HLOOKUP(B13,#REF!,2,FALSE)))","v":{"$error":"#REF!"}},{"$f":"IF(COUNTIF($B$90:$K$91,B13)=1,HLOOKUP(B13,$B$90:$K$91,2,FALSE),IF(COUNTIF($B$92:$K$93,B13)=1,HLOOKUP(B13,$B$92:$K$93,2,FALSE),HLOOKUP(B13,#REF!,2,FALSE)))","v":{"$error":"#REF!"}},{"$f":"IF(COUNTIF($B$98:$K$99,B13)=1,HLOOKUP(B13,$B$98:$K$99,2,FALSE),IF(COUNTIF($B$100:$K$101,B13)=1,HLOOKUP(B13,$B$100:$K$101,2,FALSE),HLOOKUP(B13,#REF!,2,FALSE)))","v":{"$error":"#REF!"}},{"$f":"IF(COUNTIF($B$106:$K$107,B13)=1,HLOOKUP(B13,$B$106:$K$107,2,FALSE),IF(COUNTIF($B$108:$K$109,B13)=1,HLOOKUP(B13,$B$108:$K$109,2,FALSE),HLOOKUP(B13,#REF!,2,FALSE)))","v":{"$error":"#REF!"}},{"$f":"IF(COUNTIF($B$114:$K$115,B13)=1,HLOOKUP(B13,$B$114:$K$115,2,FALSE),IF(COUNTIF($B$116:$K$117,B13)=1,HLOOKUP(B13,$B$116:$K$117,2,FALSE),HLOOKUP(B13,#REF!,2,FALSE)))","v":{"$error":"#REF!"}},{"$f":"IF(COUNTIF($B$122:$K$123,B13)=1,HLOOKUP(B13,$B$122:$K$123,2,FALSE),IF(COUNTIF($B$124:$K$125,B13)=1,HLOOKUP(B13,$B$124:$K$125,2,FALSE),HLOOKUP(B13,#REF!,2,FALSE)))","v":{"$error":"#REF!"}},{"$f":"IF(COUNTIF($B$130:$K$131,B13)=1,HLOOKUP(B13,$B$130:$K$131,2,FALSE),IF(COUNTIF($B$132:$K$133,B13)=1,HLOOKUP(B13,$B$132:$K$133,2,FALSE),HLOOKUP(B13,#REF!,2,FALSE)))","v":{"$error":"#REF!"}},{"$f":"IF(COUNTIF($B$138:$K$139,B13)=1,HLOOKUP(B13,$B$138:$K$139,2,FALSE),IF(COUNTIF($B$140:$K$141,B13)=1,HLOOKUP(B13,$B$140:$K$141,2,FALSE),HLOOKUP(B13,#REF!,2,FALSE)))","v":{"$error":"#REF!"}},{"$f":"IF(COUNTIF($B$146:$K$147,B13)=1,HLOOKUP(B13,$B$146:$K$147,2,FALSE),IF(COUNTIF($B$148:$K$149,B13)=1,HLOOKUP(B13,$B$148:$K$149,2,FALSE),HLOOKUP(B13,#REF!,2,FALSE)))","v":{"$error":"#REF!"}},{"$f":"IF(COUNTIF($B$154:$K$155,B13)=1,HLOOKUP(B13,$B$154:$K$155,2,FALSE),IF(COUNTIF($B$156:$K$157,B13)=1,HLOOKUP(B13,$B$156:$K$157,2,FALSE),HLOOKUP(B13,$B$158:$K$159,2,FALSE)))","v":{"$error":"#N/A"}},null,null,null,{"$f":"SUM(C13:R13)","v":{"$error":"#REF!"}},{"$f":"IF(V13=SMALL(V$3:V$30,1),\"1\",IF(V13=SMALL(V$3:V$30,2),\"2\",IF(V13=SMALL(V$3:V$30,3),\"3\",IF(V13=SMALL(V$3:V$30,4),\"4\",IF(V13=SMALL(V$3:V$30,5),\"5\",IF(V13=SMALL(V$3:V$30,6),\"6\",IF(V13=SMALL(V$3:V$30,7),\"7\",IF(V13=SMALL(V$3:V$30,8),\"8\",IF(V13=SMALL(V$3:V$30,9),\"9\",IF(V13=SMALL(V$3:V$30,10),\"10\",IF(V13=SMALL(V$3:V$30,11),\"11\",IF(V13=SMALL(V$3:V$30,12),\"12\",IF(V13=SMALL(V$3:V$30,13),\"13\",IF(V13=SMALL(V$3:V$30,14),\"14\",IF(V13=SMALL(V$3:V$30,15),\"15\",IF(V13=SMALL(V$3:V$30,16),\"16\",IF(V13=SMALL(V$3:V$30,17),\"17\",IF(V13=SMALL(V$3:V$30,18),\"18\",IF(V13=SMALL(V$3:V$30,19),\"19\",IF(V13=SMALL(V$3:V$30,20),\"20\",IF(V13=SMALL(V$3:V$30,21),\"21\",IF(V13=SMALL(V$3:V$30,22),\"22\",IF(V13=SMALL(V$3:V$30,23),\"23\",IF(V13=SMALL(V$3:V$30,24),\"24\",IF(V13=SMALL(V$3:V$30,25),\"25\",IF(V13=SMALL(V$3:V$30,26),\"26\",IF(V13=SMALL(V$3:V$30,27),\"27\",IF(V13=SMALL(V$3:V$30,28),\"28\",IF(V13=SMALL(V$3:V$30,29),\"29\",IF(V13=SMALL(V$3:V$30,30),\"30\",IF(V13=SMALL(V$3:V$30,31),\"31\",IF(V13=SMALL(V$3:V$30,32),\"32\",IF(V13=SMALL(V$3:V$30,33),\"33\",IF(V13=SMALL(V$3:V$30,34),\"34\"))))))))))))))))))))))))))))))))))","v":{"$error":"#REF!"}},{"$f":"COUNTIF($C13:$R13,X$1)","v":0},0,0,0,0,0,0]
[14,"Equipage 14",{"$f":"IF(COUNTIF($B$34:$K$35,B14)=1,HLOOKUP(B14,$B$34:$K$35,2,FALSE),IF(COUNTIF($B$36:$K$37,B14)=1,HLOOKUP(B14,$B$36:$K$37,2,FALSE),HLOOKUP(B14,#REF!,2,FALSE)))","v":{"$error":"#REF!"}},{"$f":"IF(COUNTIF($B$42:$K$43,B14)=1,HLOOKUP(B14,$B$42:$K$43,2,FALSE),IF(COUNTIF($B$44:$K$45,B14)=1,HLOOKUP(B14,$B$44:$K$45,2,FALSE),HLOOKUP(B14,#REF!,2,FALSE)))","v":{"$error":"#REF!"}},{"$f":"IF(COUNTIF($B$50:$K$51,B14)=1,HLOOKUP(B14,$B$50:$K$51,2,FALSE),IF(COUNTIF($B$52:$K$53,B14)=1,HLOOKUP(B14,$B$52:$K$53,2,FALSE),HLOOKUP(B14,#REF!,2,FALSE)))","v":{"$error":"#REF!"}},{"$f":"IF(COUNTIF($B$58:$K$59,B14)=1,HLOOKUP(B14,$B$58:$K$59,2,FALSE),IF(COUNTIF($B$60:$K$61,B14)=1,HLOOKUP(B14,$B$60:$K$61,2,FALSE),HLOOKUP(B14,#REF!,2,FALSE)))","v":{"$error":"#REF!"}},{"$f":"IF(COUNTIF($B$66:$K$67,B14)=1,HLOOKUP(B14,$B$66:$K$67,2,FALSE),IF(COUNTIF($B$68:$K$69,B14)=1,HLOOKUP(B14,$B$68:$K$69,2,FALSE),HLOOKUP(B14,#REF!,2,FALSE)))","v":{"$error":"#REF!"}},{"$f":"IF(COUNTIF($B$74:$K$75,B14)=1,HLOOKUP(B14,$B$74:$K$75,2,FALSE),IF(COUNTIF($B$76:$K$77,B14)=1,HLOOKUP(B14,$B$76:$K$77,2,FALSE),HLOOKUP(B14,#REF!,2,FALSE)))","v":{"$error":"#REF!"}},{"$f":"IF(COUNTIF($B$82:$K$83,B14)=1,HLOOKUP(B14,$B$82:$K$83,2,FALSE),IF(COUNTIF($B$84:$K$85,B14)=1,HLOOKUP(B14,$B$84:$K$85,2,FALSE),HLOOKUP(B14,#REF!,2,FALSE)))","v":{"$error":"#REF!"}},{"$f":"IF(COUNTIF($B$90:$K$91,B14)=1,HLOOKUP(B14,$B$90:$K$91,2,FALSE),IF(COUNTIF($B$92:$K$93,B14)=1,HLOOKUP(B14,$B$92:$K$93,2,FALSE),HLOOKUP(B14,#REF!,2,FALSE)))","v":{"$error":"#REF!"}},{"$f":"IF(COUNTIF($B$98:$K$99,B14)=1,HLOOKUP(B14,$B$98:$K$99,2,FALSE),IF(COUNTIF($B$100:$K$101,B14)=1,HLOOKUP(B14,$B$100:$K$101,2,FALSE),HLOOKUP(B14,#REF!,2,FALSE)))","v":{"$error":"#REF!"}},{"$f":"IF(COUNTIF($B$106:$K$107,B14)=1,HLOOKUP(B14,$B$106:$K$107,2,FALSE),IF(COUNTIF($B$108:$K$109,B14)=1,HLOOKUP(B14,$B$108:$K$109,2,FALSE),HLOOKUP(B14,#REF!,2,FALSE)))","v":{"$error":"#REF!"}},{"$f":"IF(COUNTIF($B$114:$K$115,B14)=1,HLOOKUP(B14,$B$114:$K$115,2,FALSE),IF(COUNTIF($B$116:$K$117,B14)=1,HLOOKUP(B14,$B$116:$K$117,2,FALSE),HLOOKUP(B14,#REF!,2,FALSE)))","v":{"$error":"#REF!"}},{"$f":"IF(COUNTIF($B$122:$K$123,B14)=1,HLOOKUP(B14,$B$122:$K$123,2,FALSE),IF(COUNTIF($B$124:$K$125,B14)=1,HLOOKUP(B14,$B$124:$K$125,2,FALSE),HLOOKUP(B14,#REF!,2,FALSE)))","v":{"$error":"#REF!"}},{"$f":"IF(COUNTIF($B$130:$K$131,B14)=1,HLOOKUP(B14,$B$130:$K$131,2,FALSE),IF(COUNTIF($B$132:$K$133,B14)=1,HLOOKUP(B14,$B$132:$K$133,2,FALSE),HLOOKUP(B14,#REF!,2,FALSE)))","v":{"$error":"#REF!"}},{"$f":"IF(COUNTIF($B$138:$K$139,B14)=1,HLOOKUP(B14,$B$138:$K$139,2,FALSE),IF(COUNTIF($B$140:$K$141,B14)=1,HLOOKUP(B14,$B$140:$K$141,2,FALSE),HLOOKUP(B14,#REF!,2,FALSE)))","v":{"$error":"#REF!"}},{"$f":"IF(COUNTIF($B$146:$K$147,B14)=1,HLOOKUP(B14,$B$146:$K$147,2,FALSE),IF(COUNTIF($B$148:$K$149,B14)=1,HLOOKUP(B14,$B$148:$K$149,2,FALSE),HLOOKUP(B14,#REF!,2,FALSE)))","v":{"$error":"#REF!"}},{"$error":"#N/A"},null,null,null,{"$error":"#REF!"},{"$error":"#REF!"},0,0,0,0,0,0,0]
[15,"Equipage 15",{"$f":"IF(COUNTIF($B$34:$K$35,B15)=1,HLOOKUP(B15,$B$34:$K$35,2,FALSE),IF(COUNTIF($B$36:$K$37,B15)=1,HLOOKUP(B15,$B$36:$K$37,2,FALSE),HLOOKUP(B15,#REF!,2,FALSE)))","v":{"$error":"#REF!"}},{"$f":"IF(COUNTIF($B$42:$K$43,B15)=1,HLOOKUP(B15,$B$42:$K$43,2,FALSE),IF(COUNTIF($B$44:$K$45,B15)=1,HLOOKUP(B15,$B$44:$K$45,2,FALSE),HLOOKUP(B15,#REF!,2,FALSE)))","v":{"$error":"#REF!"}},{"$f":"IF(COUNTIF($B$50:$K$51,B15)=1,HLOOKUP(B15,$B$50:$K$51,2,FALSE),IF(COUNTIF($B$52:$K$53,B15)=1,HLOOKUP(B15,$B$52:$K$53,2,FALSE),HLOOKUP(B15,#REF!,2,FALSE)))","v":{"$error":"#REF!"}},{"$f":"IF(COUNTIF($B$58:$K$59,B15)=1,HLOOKUP(B15,$B$58:$K$59,2,FALSE),IF(COUNTIF($B$60:$K$61,B15)=1,HLOOKUP(B15,$B$60:$K$61,2,FALSE),HLOOKUP(B15,#REF!,2,FALSE)))","v":{"$error":"#REF!"}},{"$f":"IF(COUNTIF($B$66:$K$67,B15)=1,HLOOKUP(B15,$B$66:$K$67,2,FALSE),IF(COUNTIF($B$68:$K$69,B15)=1,HLOOKUP(B15,$B$68:$K$69,2,FALSE),HLOOKUP(B15,#REF!,2,FALSE)))","v":{"$error":"#REF!"}},{"$f":"IF(COUNTIF($B$74:$K$75,B15)=1,HLOOKUP(B15,$B$74:$K$75,2,FALSE),IF(COUNTIF($B$76:$K$77,B15)=1,HLOOKUP(B15,$B$76:$K$77,2,FALSE),HLOOKUP(B15,#REF!,2,FALSE)))","v":{"$error":"#REF!"}},{"$f":"IF(COUNTIF($B$82:$K$83,B15)=1,HLOOKUP(B15,$B$82:$K$83,2,FALSE),IF(COUNTIF($B$84:$K$85,B15)=1,HLOOKUP(B15,$B$84:$K$85,2,FALSE),HLOOKUP(B15,#REF!,2,FALSE)))","v":{"$error":"#REF!"}},{"$f":"IF(COUNTIF($B$90:$K$91,B15)=1,HLOOKUP(B15,$B$90:$K$91,2,FALSE),IF(COUNTIF($B$92:$K$93,B15)=1,HLOOKUP(B15,$B$92:$K$93,2,FALSE),HLOOKUP(B15,#REF!,2,FALSE)))","v":{"$error":"#REF!"}},{"$f":"IF(COUNTIF($B$98:$K$99,B15)=1,HLOOKUP(B15,$B$98:$K$99,2,FALSE),IF(COUNTIF($B$100:$K$101,B15)=1,HLOOKUP(B15,$B$100:$K$101,2,FALSE),HLOOKUP(B15,#REF!,2,FALSE)))","v":{"$error":"#REF!"}},{"$f":"IF(COUNTIF($B$106:$K$107,B15)=1,HLOOKUP(B15,$B$106:$K$107,2,FALSE),IF(COUNTIF($B$108:$K$109,B15)=1,HLOOKUP(B15,$B$108:$K$109,2,FALSE),HLOOKUP(B15,#REF!,2,FALSE)))","v":{"$error":"#REF!"}},{"$f":"IF(COUNTIF($B$114:$K$115,B15)=1,HLOOKUP(B15,$B$114:$K$115,2,FALSE),IF(COUNTIF($B$116:$K$117,B15)=1,HLOOKUP(B15,$B$116:$K$117,2,FALSE),HLOOKUP(B15,#REF!,2,FALSE)))","v":{"$error":"#REF!"}},{"$f":"IF(COUNTIF($B$122:$K$123,B15)=1,HLOOKUP(B15,$B$122:$K$123,2,FALSE),IF(COUNTIF($B$124:$K$125,B15)=1,HLOOKUP(B15,$B$124:$K$125,2,FALSE),HLOOKUP(B15,#REF!,2,FALSE)))","v":{"$error":"#REF!"}},{"$f":"IF(COUNTIF($B$130:$K$131,B15)=1,HLOOKUP(B15,$B$130:$K$131,2,FALSE),IF(COUNTIF($B$132:$K$133,B15)=1,HLOOKUP(B15,$B$132:$K$133,2,FALSE),HLOOKUP(B15,#REF!,2,FALSE)))","v":{"$error":"#REF!"}},{"$f":"IF(COUNTIF($B$138:$K$139,B15)=1,HLOOKUP(B15,$B$138:$K$139,2,FALSE),IF(COUNTIF($B$140:$K$141,B15)=1,HLOOKUP(B15,$B$140:$K$141,2,FALSE),HLOOKUP(B15,#REF!,2,FALSE)))","v":{"$error":"#REF!"}},{"$f":"IF(COUNTIF($B$146:$K$147,B15)=1,HLOOKUP(B15,$B$146:$K$147,2,FALSE),IF(COUNTIF($B$148:$K$149,B15)=1,HLOOKUP(B15,$B$148:$K$149,2,FALSE),HLOOKUP(B15,#REF!,2,FALSE)))","v":{"$error":"#REF!"}},{"$error":"#N/A"},null,null,null,{"$error":"#REF!"},{"$error":"#REF!"},0,0,0,0,0,0,0]
[16,"Equipage 16",{"$f":"IF(COUNTIF($B$34:$K$35,B16)=1,HLOOKUP(B16,$B$34:$K$35,2,FALSE),IF(COUNTIF($B$36:$K$37,B16)=1,HLOOKUP(B16,$B$36:$K$37,2,FALSE),HLOOKUP(B16,#REF!,2,FALSE)))","v":{"$error":"#REF!"}},{"$f":"IF(COUNTIF($B$42:$K$43,B16)=1,HLOOKUP(B16,$B$42:$K$43,2,FALSE),IF(COUNTIF($B$44:$K$45,B16)=1,HLOOKUP(B16,$B$44:$K$45,2,FALSE),HLOOKUP(B16,#REF!,2,FALSE)))","v":{"$error":"#REF!"}},{"$f":"IF(COUNTIF($B$50:$K$51,B16)=1,HLOOKUP(B16,$B$50:$K$51,2,FALSE),IF(COUNTIF($B$52:$K$53,B16)=1,HLOOKUP(B16,$B$52:$K$53,2,FALSE),HLOOKUP(B16,#REF!,2,FALSE)))","v":{"$error":"#REF!"}},{"$f":"IF(COUNTIF($B$58:$K$59,B16)=1,HLOOKUP(B16,$B$58:$K$59,2,FALSE),IF(COUNTIF($B$60:$K$61,B16)=1,HLOOKUP(B16,$B$60:$K$61,2,FALSE),HLOOKUP(B16,#REF!,2,FALSE)))","v":{"$error":"#REF!"}},{"$f":"IF(COUNTIF($B$66:$K$67,B16)=1,HLOOKUP(B16,$B$66:$K$67,2,FALSE),IF(COUNTIF($B$68:$K$69,B16)=1,HLOOKUP(B16,$B$68:$K$69,2,FALSE),HLOOKUP(B16,#REF!,2,FALSE)))","v":{"$error":"#REF!"}},{"$f":"IF(COUNTIF($B$74:$K$75,B16)=1,HLOOKUP(B16,$B$74:$K$75,2,FALSE),IF(COUNTIF($B$76:$K$77,B16)=1,HLOOKUP(B16,$B$76:$K$77,2,FALSE),HLOOKUP(B16,#REF!,2,FALSE)))","v":{"$error":"#REF!"}},{"$f":"IF(COUNTIF($B$82:$K$83,B16)=1,HLOOKUP(B16,$B$82:$K$83,2,FALSE),IF(COUNTIF($B$84:$K$85,B16)=1,HLOOKUP(B16,$B$84:$K$85,2,FALSE),HLOOKUP(B16,#REF!,2,FALSE)))","v":{"$error":"#REF!"}},{"$f":"IF(COUNTIF($B$90:$K$91,B16)=1,HLOOKUP(B16,$B$90:$K$91,2,FALSE),IF(COUNTIF($B$92:$K$93,B16)=1,HLOOKUP(B16,$B$92:$K$93,2,FALSE),HLOOKUP(B16,#REF!,2,FALSE)))","v":{"$error":"#REF!"}},{"$f":"IF(COUNTIF($B$98:$K$99,B16)=1,HLOOKUP(B16,$B$98:$K$99,2,FALSE),IF(COUNTIF($B$100:$K$101,B16)=1,HLOOKUP(B16,$B$100:$K$101,2,FALSE),HLOOKUP(B16,#REF!,2,FALSE)))","v":{"$error":"#REF!"}},{"$f":"IF(COUNTIF($B$106:$K$107,B16)=1,HLOOKUP(B16,$B$106:$K$107,2,FALSE),IF(COUNTIF($B$108:$K$109,B16)=1,HLOOKUP(B16,$B$108:$K$109,2,FALSE),HLOOKUP(B16,#REF!,2,FALSE)))","v":{"$error":"#REF!"}},{"$f":"IF(COUNTIF($B$114:$K$115,B16)=1,HLOOKUP(B16,$B$114:$K$115,2,FALSE),IF(COUNTIF($B$116:$K$117,B16)=1,HLOOKUP(B16,$B$116:$K$117,2,FALSE),HLOOKUP(B16,#REF!,2,FALSE)))","v":{"$error":"#REF!"}},{"$f":"IF(COUNTIF($B$122:$K$123,B16)=1,HLOOKUP(B16,$B$122:$K$123,2,FALSE),IF(COUNTIF($B$124:$K$125,B16)=1,HLOOKUP(B16,$B$124:$K$125,2,FALSE),HLOOKUP(B16,#REF!,2,FALSE)))","v":{"$error":"#REF!"}},{"$f":"IF(COUNTIF($B$130:$K$131,B16)=1,HLOOKUP(B16,$B$130:$K$131,2,FALSE),IF(COUNTIF($B$132:$K$133,B16)=1,HLOOKUP(B16,$B$132:$K$133,2,FALSE),HLOOKUP(B16,#REF!,2,FALSE)))","v":{"$error":"#REF!"}},{"$f":"IF(COUNTIF($B$138:$K$139,B16)=1,HLOOKUP(B16,$B$138:$K$139,2,FALSE),IF(COUNTIF($B$140:$K$141,B16)=1,HLOOKUP(B16,$B$140:$K$141,2,FALSE),HLOOKUP(B16,#REF!,2,FALSE)))","v":{"$error":"#REF!"}},{"$f":"IF(COUNTIF($B$146:$K$147,B16)=1,HLOOKUP(B16,$B$146:$K$147,2,FALSE),IF(COUNTIF($B$148:$K$149,B16)=1,HLOOKUP(B16,$B$148:$K$149,2,FALSE),HLOOKUP(B16,#REF!,2,FALSE)))","v":{"$error":"#REF!"}},{"$error":"#N/A"},null,null,null,{"$error":"#REF!"},{"$error":"#REF!"},0,0,0,0,0,0,0]
[17,"Equipage 17",{"$f":"IF(COUNTIF($B$34:$K$35,B17)=1,HLOOKUP(B17,$B$34:$K$35,2,FALSE),IF(COUNTIF($B$36:$K$37,B17)=1,HLOOKUP(B17,$B$36:$K$37,2,FALSE),HLOOKUP(B17,#REF!,2,FALSE)))","v":{"$error":"#REF!"}},{"$f":"IF(COUNTIF($B$42:$K$43,B17)=1,HLOOKUP(B17,$B$42:$K$43,2,FALSE),IF(COUNTIF($B$44:$K$45,B17)=1,HLOOKUP(B17,$B$44:$K$45,2,FALSE),HLOOKUP(B17,#REF!,2,FALSE)))","v":{"$error":"#REF!"}},{"$f":"IF(COUNTIF($B$50:$K$51,B17)=1,HLOOKUP(B17,$B$50:$K$51,2,FALSE),IF(COUNTIF($B$52:$K$53,B17)=1,HLOOKUP(B17,$B$52:$K$53,2,FALSE),HLOOKUP(B17,#REF!,2,FALSE)))","v":{"$error":"#REF!"}},{"$f":"IF(COUNTIF($B$58:$K$59,B17)=1,HLOOKUP(B17,$B$58:$K$59,2,FALSE),IF(COUNTIF($B$60:$K$61,B17)=1,HLOOKUP(B17,$B$60:$K$61,2,FALSE),HLOOKUP(B17,#REF!,2,FALSE)))","v":{"$error":"#REF!"}},{"$f":"IF(COUNTIF($B$66:$K$67,B17)=1,HLOOKUP(B17,$B$66:$K$67,2,FALSE),IF(COUNTIF($B$68:$K$69,B17)=1,HLOOKUP(B17,$B$68:$K$69,2,FALSE),HLOOKUP(B17,#REF!,2,FALSE)))","v":{"$error":"#REF!"}},{"$f":"IF(COUNTIF($B$74:$K$75,B17)=1,HLOOKUP(B17,$B$74:$K$75,2,FALSE),IF(COUNTIF($B$76:$K$77,B17)=1,HLOOKUP(B17,$B$76:$K$77,2,FALSE),HLOOKUP(B17,#REF!,2,FALSE)))","v":{"$error":"#REF!"}},{"$f":"IF(COUNTIF($B$82:$K$83,B17)=1,HLOOKUP(B17,$B$82:$K$83,2,FALSE),IF(COUNTIF($B$84:$K$85,B17)=1,HLOOKUP(B17,$B$84:$K$85,2,FALSE),HLOOKUP(B17,#REF!,2,FALSE)))","v":{"$error":"#REF!"}},{"$f":"IF(COUNTIF($B$90:$K$91,B17)=1,HLOOKUP(B17,$B$90:$K$91,2,FALSE),IF(COUNTIF($B$92:$K$93,B17)=1,HLOOKUP(B17,$B$92:$K$93,2,FALSE),HLOOKUP(B17,#REF!,2,FALSE)))","v":{"$error":"#REF!"}},{"$f":"IF(COUNTIF($B$98:$K$99,B17)=1,HLOOKUP(B17,$B$98:$K$99,2,FALSE),IF(COUNTIF($B$100:$K$101,B17)=1,HLOOKUP(B17,$B$100:$K$101,2,FALSE),HLOOKUP(B17,#REF!,2,FALSE)))","v":{"$error":"#REF!"}},{"$f":"IF(COUNTIF($B$106:$K$107,B17)=1,HLOOKUP(B17,$B$106:$K$107,2,FALSE),IF(COUNTIF($B$108:$K$109,B17)=1,HLOOKUP(B17,$B$108:$K$109,2,FALSE),HLOOKUP(B17,#REF!,2,FALSE)))","v":{"$error":"#REF!"}},{"$f":"IF(COUNTIF($B$114:$K$115,B17)=1,HLOOKUP(B17,$B$114:$K$115,2,FALSE),IF(COUNTIF($B$116:$K$117,B17)=1,HLOOKUP(B17,$B$116:$K$117,2,FALSE),HLOOKUP(B17,#REF!,2,FALSE)))","v":{"$error":"#REF!"}},{"$f":"IF(COUNTIF($B$122:$K$123,B17)=1,HLOOKUP(B17,$B$122:$K$123,2,FALSE),IF(COUNTIF($B$124:$K$125,B17)=1,HLOOKUP(B17,$B$124:$K$125,2,FALSE),HLOOKUP(B17,#REF!,2,FALSE)))","v":{"$error":"#REF!"}},{"$f":"IF(COUNTIF($B$130:$K$131,B17)=1,HLOOKUP(B17,$B$130:$K$131,2,FALSE),IF(COUNTIF($B$132:$K$133,B17)=1,HLOOKUP(B17,$B$132:$K$133,2,FALSE),HLOOKUP(B17,#REF!,2,FALSE)))","v":{"$error":"#REF!"}},{"$f":"IF(COUNTIF($B$138:$K$139,B17)=1,HLOOKUP(B17,$B$138:$K$139,2,FALSE),IF(COUNTIF($B$140:$K$141,B17)=1,HLOOKUP(B17,$B$140:$K$141,2,FALSE),HLOOKUP(B17,#REF!,2,FALSE)))","v":{"$error":"#REF!"}},{"$f":"IF(COUNTIF($B$146:$K$147,B17)=1,HLOOKUP(B17,$B$146:$K$147,2,FALSE),IF(COUNTIF($B$148:$K$149,B17)=1,HLOOKUP(B17,$B$148:$K$149,2,FALSE),HLOOKUP(B17,#REF!,2,FALSE)))","v":{"$error":"#REF!"}},{"$error":"#N/A"},null,null,null,{"$error":"#REF!"},{"$error":"#REF!"},0,0,0,0,0,0,0]
[18,"Equipage 18",{"$f":"IF(COUNTIF($B$34:$K$35,B18)=1,HLOOKUP(B18,$B$34:$K$35,2,FALSE),IF(COUNTIF($B$36:$K$37,B18)=1,HLOOKUP(B18,$B$36:$K$37,2,FALSE),HLOOKUP(B18,#REF!,2,FALSE)))","v":{"$error":"#REF!"}},{"$f":"IF(COUNTIF($B$42:$K$43,B18)=1,HLOOKUP(B18,$B$42:$K$43,2,FALSE),IF(COUNTIF($B$44:$K$45,B18)=1,HLOOKUP(B18,$B$44:$K$45,2,FALSE),HLOOKUP(B18,#REF!,2,FALSE)))","v":{"$error":"#REF!"}},{"$f":"IF(COUNTIF($B$50:$K$51,B18)=1,HLOOKUP(B18,$B$50:$K$51,2,FALSE),IF(COUNTIF($B$52:$K$53,B18)=1,HLOOKUP(B18,$B$52:$K$53,2,FALSE),HLOOKUP(B18,#REF!,2,FALSE)))","v":{"$error":"#REF!"}},{"$f":"IF(COUNTIF($B$58:$K$59,B18)=1,HLOOKUP(B18,$B$58:$K$59,2,FALSE),IF(COUNTIF($B$60:$K$61,B18)=1,HLOOKUP(B18,$B$60:$K$61,2,FALSE),HLOOKUP(B18,#REF!,2,FALSE)))","v":{"$error":"#REF!"}},{"$f":"IF(COUNTIF($B$66:$K$67,B18)=1,HLOOKUP(B18,$B$66:$K$67,2,FALSE),IF(COUNTIF($B$68:$K$69,B18)=1,HLOOKUP(B18,$B$68:$K$69,2,FALSE),HLOOKUP(B18,#REF!,2,FALSE)))","v":{"$error":"#REF!"}},{"$f":"IF(COUNTIF($B$74:$K$75,B18)=1,HLOOKUP(B18,$B$74:$K$75,2,FALSE),IF(COUNTIF($B$76:$K$77,B18)=1,HLOOKUP(B18,$B$76:$K$77,2,FALSE),HLOOKUP(B18,#REF!,2,FALSE)))","v":{"$error":"#REF!"}},{"$f":"IF(COUNTIF($B$82:$K$83,B18)=1,HLOOKUP(B18,$B$82:$K$83,2,FALSE),IF(COUNTIF($B$84:$K$85,B18)=1,HLOOKUP(B18,$B$84:$K$85,2,FALSE),HLOOKUP(B18,#REF!,2,FALSE)))","v":{"$error":"#REF!"}},{"$f":"IF(COUNTIF($B$90:$K$91,B18)=1,HLOOKUP(B18,$B$90:$K$91,2,FALSE),IF(COUNTIF($B$92:$K$93,B18)=1,HLOOKUP(B18,$B$92:$K$93,2,FALSE),HLOOKUP(B18,#REF!,2,FALSE)))","v":{"$error":"#REF!"}},{"$f":"IF(COUNTIF($B$98:$K$99,B18)=1,HLOOKUP(B18,$B$98:$K$99,2,FALSE),IF(COUNTIF($B$100:$K$101,B18)=1,HLOOKUP(B18,$B$100:$K$101,2,FALSE),HLOOKUP(B18,#REF!,2,FALSE)))","v":{"$error":"#REF!"}},{"$f":"IF(COUNTIF($B$106:$K$107,B18)=1,HLOOKUP(B18,$B$106:$K$107,2,FALSE),IF(COUNTIF($B$108:$K$109,B18)=1,HLOOKUP(B18,$B$108:$K$109,2,FALSE),HLOOKUP(B18,#REF!,2,FALSE)))","v":{"$error":"#REF!"}},{"$f":"IF(COUNTIF($B$114:$K$115,B18)=1,HLOOKUP(B18,$B$114:$K$115,2,FALSE),IF(COUNTIF($B$116:$K$117,B18)=1,HLOOKUP(B18,$B$116:$K$117,2,FALSE),HLOOKUP(B18,#REF!,2,FALSE)))","v":{"$error":"#REF!"}},{"$f":"IF(COUNTIF($B$122:$K$123,B18)=1,HLOOKUP(B18,$B$122:$K$123,2,FALSE),IF(COUNTIF($B$124:$K$125,B18)=1,HLOOKUP(B18,$B$124:$K$125,2,FALSE),HLOOKUP(B18,#REF!,2,FALSE)))","v":{"$error":"#REF!"}},{"$f":"IF(COUNTIF($B$130:$K$131,B18)=1,HLOOKUP(B18,$B$130:$K$131,2,FALSE),IF(COUNTIF($B$132:$K$133,B18)=1,HLOOKUP(B18,$B$132:$K$133,2,FALSE),HLOOKUP(B18,#REF!,2,FALSE)))","v":{"$error":"#REF!"}},{"$f":"IF(COUNTIF($B$138:$K$139,B18)=1,HLOOKUP(B18,$B$138:$K$139,2,FALSE),IF(COUNTIF($B$140:$K$141,B18)=1,HLOOKUP(B18,$B$140:$K$141,2,FALSE),HLOOKUP(B18,#REF!,2,FALSE)))","v":{"$error":"#REF!"}},{"$f":"IF(COUNTIF($B$146:$K$147,B18)=1,HLOOKUP(B18,$B$146:$K$147,2,FALSE),IF(COUNTIF($B$148:$K$149,B18)=1,HLOOKUP(B18,$B$148:$K$149,2,FALSE),HLOOKUP(B18,#REF!,2,FALSE)))","v":{"$error":"#REF!"}},{"$error":"#N/A"},null,null,null,{"$error":"#REF!"},{"$error":"#REF!"},0,0,0,0,0,0,0]
[19,"Equipage 19",{"$f":"IF(COUNTIF($B$34:$K$35,B19)=1,HLOOKUP(B19,$B$34:$K$35,2,FALSE),IF(COUNTIF($B$36:$K$37,B19)=1,HLOOKUP(B19,$B$36:$K$37,2,FALSE),HLOOKUP(B19,#REF!,2,FALSE)))","v":{"$error":"#REF!"}},{"$f":"IF(COUNTIF($B$42:$K$43,B19)=1,HLOOKUP(B19,$B$42:$K$43,2,FALSE),IF(COUNTIF($B$44:$K$45,B19)=1,HLOOKUP(B19,$B$44:$K$45,2,FALSE),HLOOKUP(B19,#REF!,2,FALSE)))","v":{"$error":"#REF!"}},{"$f":"IF(COUNTIF($B$50:$K$51,B19)=1,HLOOKUP(B19,$B$50:$K$51,2,FALSE),IF(COUNTIF($B$52:$K$53,B19)=1,HLOOKUP(B19,$B$52:$K$53,2,FALSE),HLOOKUP(B19,#REF!,2,FALSE)))","v":{"$error":"#REF!"}},{"$f":"IF(COUNTIF($B$58:$K$59,B19)=1,HLOOKUP(B19,$B$58:$K$59,2,FALSE),IF(COUNTIF($B$60:$K$61,B19)=1,HLOOKUP(B19,$B$60:$K$61,2,FALSE),HLOOKUP(B19,#REF!,2,FALSE)))","v":{"$error":"#REF!"}},{"$f":"IF(COUNTIF($B$66:$K$67,B19)=1,HLOOKUP(B19,$B$66:$K$67,2,FALSE),IF(COUNTIF($B$68:$K$69,B19)=1,HLOOKUP(B19,$B$68:$K$69,2,FALSE),HLOOKUP(B19,#REF!,2,FALSE)))","v":{"$error":"#REF!"}},{"$f":"IF(COUNTIF($B$74:$K$75,B19)=1,HLOOKUP(B19,$B$74:$K$75,2,FALSE),IF(COUNTIF($B$76:$K$77,B19)=1,HLOOKUP(B19,$B$76:$K$77,2,FALSE),HLOOKUP(B19,#REF!,2,FALSE)))","v":{"$error":"#REF!"}},{"$f":"IF(COUNTIF($B$82:$K$83,B19)=1,HLOOKUP(B19,$B$82:$K$83,2,FALSE),IF(COUNTIF($B$84:$K$85,B19)=1,HLOOKUP(B19,$B$84:$K$85,2,FALSE),HLOOKUP(B19,#REF!,2,FALSE)))","v":{"$error":"#REF!"}},{"$f":"IF(COUNTIF($B$90:$K$91,B19)=1,HLOOKUP(B19,$B$90:$K$91,2,FALSE),IF(COUNTIF($B$92:$K$93,B19)=1,HLOOKUP(B19,$B$92:$K$93,2,FALSE),HLOOKUP(B19,#REF!,2,FALSE)))","v":{"$error":"#REF!"}},{"$f":"IF(COUNTIF($B$98:$K$99,B19)=1,HLOOKUP(B19,$B$98:$K$99,2,FALSE),IF(COUNTIF($B$100:$K$101,B19)=1,HLOOKUP(B19,$B$100:$K$101,2,FALSE),HLOOKUP(B19,#REF!,2,FALSE)))","v":{"$error":"#REF!"}},{"$f":"IF(COUNTIF($B$106:$K$107,B19)=1,HLOOKUP(B19,$B$106:$K$107,2,FALSE),IF(COUNTIF($B$108:$K$109,B19)=1,HLOOKUP(B19,$B$108:$K$109,2,FALSE),HLOOKUP(B19,#REF!,2,FALSE)))","v":{"$error":"#REF!"}},{"$f":"IF(COUNTIF($B$114:$K$115,B19)=1,HLOOKUP(B19,$B$114:$K$115,2,FALSE),IF(COUNTIF($B$116:$K$117,B19)=1,HLOOKUP(B19,$B$116:$K$117,2,FALSE),HLOOKUP(B19,#REF!,2,FALSE)))","v":{"$error":"#REF!"}},{"$f":"IF(COUNTIF($B$122:$K$123,B19)=1,HLOOKUP(B19,$B$122:$K$123,2,FALSE),IF(COUNTIF($B$124:$K$125,B19)=1,HLOOKUP(B19,$B$124:$K$125,2,FALSE),HLOOKUP(B19,#REF!,2,FALSE)))","v":{"$error":"#REF!"}},{"$f":"IF(COUNTIF($B$130:$K$131,B19)=1,HLOOKUP(B19,$B$130:$K$131,2,FALSE),IF(COUNTIF($B$132:$K$133,B19)=1,HLOOKUP(B19,$B$132:$K$133,2,FALSE),HLOOKUP(B19,#REF!,2,FALSE)))","v":{"$error":"#REF!"}},{"$f":"IF(COUNTIF($B$138:$K$139,B19)=1,HLOOKUP(B19,$B$138:$K$139,2,FALSE),IF(COUNTIF($B$140:$K$141,B19)=1,HLOOKUP(B19,$B$140:$K$141,2,FALSE),HLOOKUP(B19,#REF!,2,FALSE)))","v":{"$error":"#REF!"}},{"$f":"IF(COUNTIF($B$146:$K$147,B19)=1,HLOOKUP(B19,$B$146:$K$147,2,FALSE),IF(COUNTIF($B$148:$K$149,B19)=1,HLOOKUP(B19,$B$148:$K$149,2,FALSE),HLOOKUP(B19,#REF!,2,FALSE)))","v":{"$error":"#REF!"}},{"$error":"#N/A"},null,null,null,{"$error":"#REF!"},{"$error":"#REF!"},0,0,0,0,0,0,0]
[20,"Equipage 20",{"$f":"IF(COUNTIF($B$34:$K$35,B20)=1,HLOOKUP(B20,$B$34:$K$35,2,FALSE),IF(COUNTIF($B$36:$K$37,B20)=1,HLOOKUP(B20,$B$36:$K$37,2,FALSE),HLOOKUP(B20,#REF!,2,FALSE)))","v":{"$error":"#REF!"}},{"$f":"IF(COUNTIF($B$42:$K$43,B20)=1,HLOOKUP(B20,$B$42:$K$43,2,FALSE),IF(COUNTIF($B$44:$K$45,B20)=1,HLOOKUP(B20,$B$44:$K$45,2,FALSE),HLOOKUP(B20,#REF!,2,FALSE)))","v":{"$error":"#REF!"}},{"$f":"IF(COUNTIF($B$50:$K$51,B20)=1,HLOOKUP(B20,$B$50:$K$51,2,FALSE),IF(COUNTIF($B$52:$K$53,B20)=1,HLOOKUP(B20,$B$52:$K$53,2,FALSE),HLOOKUP(B20,#REF!,2,FALSE)))","v":{"$error":"#REF!"}},{"$f":"IF(COUNTIF($B$58:$K$59,B20)=1,HLOOKUP(B20,$B$58:$K$59,2,FALSE),IF(COUNTIF($B$60:$K$61,B20)=1,HLOOKUP(B20,$B$60:$K$61,2,FALSE),HLOOKUP(B20,#REF!,2,FALSE)))","v":{"$error":"#REF!"}},{"$f":"IF(COUNTIF($B$66:$K$67,B20)=1,HLOOKUP(B20,$B$66:$K$67,2,FALSE),IF(COUNTIF($B$68:$K$69,B20)=1,HLOOKUP(B20,$B$68:$K$69,2,FALSE),HLOOKUP(B20,#REF!,2,FALSE)))","v":{"$error":"#REF!"}},{"$f":"IF(COUNTIF($B$74:$K$75,B20)=1,HLOOKUP(B20,$B$74:$K$75,2,FALSE),IF(COUNTIF($B$76:$K$77,B20)=1,HLOOKUP(B20,$B$76:$K$77,2,FALSE),HLOOKUP(B20,#REF!,2,FALSE)))","v":{"$error":"#REF!"}},{"$f":"IF(COUNTIF($B$82:$K$83,B20)=1,HLOOKUP(B20,$B$82:$K$83,2,FALSE),IF(COUNTIF($B$84:$K$85,B20)=1,HLOOKUP(B20,$B$84:$K$85,2,FALSE),HLOOKUP(B20,#REF!,2,FALSE)))","v":{"$error":"#REF!"}},{"$f":"IF(COUNTIF($B$90:$K$91,B20)=1,HLOOKUP(B20,$B$90:$K$91,2,FALSE),IF(COUNTIF($B$92:$K$93,B20)=1,HLOOKUP(B20,$B$92:$K$93,2,FALSE),HLOOKUP(B20,#REF!,2,FALSE)))","v":{"$error":"#REF!"}},{"$f":"IF(COUNTIF($B$98:$K$99,B20)=1,HLOOKUP(B20,$B$98:$K$99,2,FALSE),IF(COUNTIF($B$100:$K$101,B20)=1,HLOOKUP(B20,$B$100:$K$101,2,FALSE),HLOOKUP(B20,#REF!,2,FALSE)))","v":{"$error":"#REF!"}},{"$f":"IF(COUNTIF($B$106:$K$107,B20)=1,HLOOKUP(B20,$B$106:$K$107,2,FALSE),IF(COUNTIF($B$108:$K$109,B20)=1,HLOOKUP(B20,$B$108:$K$109,2,FALSE),HLOOKUP(B20,#REF!,2,FALSE)))","v":{"$error":"#REF!"}},{"$f":"IF(COUNTIF($B$114:$K$115,B20)=1,HLOOKUP(B20,$B$114:$K$115,2,FALSE),IF(COUNTIF($B$116:$K$117,B20)=1,HLOOKUP(B20,$B$116:$K$117,2,FALSE),HLOOKUP(B20,#REF!,2,FALSE)))","v":{"$error":"#REF!"}},{"$f":"IF(COUNTIF($B$122:$K$123,B20)=1,HLOOKUP(B20,$B$122:$K$123,2,FALSE),IF(COUNTIF($B$124:$K$125,B20)=1,HLOOKUP(B20,$B$124:$K$125,2,FALSE),HLOOKUP(B20,#REF!,2,FALSE)))","v":{"$error":"#REF!"}},{"$f":"IF(COUNTIF($B$130:$K$131,B20)=1,HLOOKUP(B20,$B$130:$K$131,2,FALSE),IF(COUNTIF($B$132:$K$133,B20)=1,HLOOKUP(B20,$B$132:$K$133,2,FALSE),HLOOKUP(B20,#REF!,2,FALSE)))","v":{"$error":"#REF!"}},{"$f":"IF(COUNTIF($B$138:$K$139,B20)=1,HLOOKUP(B20,$B$138:$K$139,2,FALSE),IF(COUNTIF($B$140:$K$141,B20)=1,HLOOKUP(B20,$B$140:$K$141,2,FALSE),HLOOKUP(B20,#REF!,2,FALSE)))","v":{"$error":"#REF!"}},{"$f":"IF(COUNTIF($B$146:$K$147,B20)=1,HLOOKUP(B20,$B$146:$K$147,2,FALSE),IF(COUNTIF($B$148:$K$149,B20)=1,HLOOKUP(B20,$B$148:$K$149,2,FALSE),HLOOKUP(B20,#REF!,2,FALSE)))","v":{"$error":"#REF!"}},{"$error":"#N/A"},null,null,null,{"$error":"#REF!"},{"$error":"#REF!"},0,0,0,0,0,0,0]
[21,"Equipage 21",{"$f":"IF(COUNTIF($B$34:$K$35,B21)=1,HLOOKUP(B21,$B$34:$K$35,2,FALSE),IF(COUNTIF($B$36:$K$37,B21)=1,HLOOKUP(B21,$B$36:$K$37,2,FALSE),HLOOKUP(B21,#REF!,2,FALSE)))","v":{"$error":"#REF!"}},{"$f":"IF(COUNTIF($B$42:$K$43,B21)=1,HLOOKUP(B21,$B$42:$K$43,2,FALSE),IF(COUNTIF($B$44:$K$45,B21)=1,HLOOKUP(B21,$B$44:$K$45,2,FALSE),HLOOKUP(B21,#REF!,2,FALSE)))","v":{"$error":"#REF!"}},{"$f":"IF(COUNTIF($B$50:$K$51,B21)=1,HLOOKUP(B21,$B$50:$K$51,2,FALSE),IF(COUNTIF($B$52:$K$53,B21)=1,HLOOKUP(B21,$B$52:$K$53,2,FALSE),HLOOKUP(B21,#REF!,2,FALSE)))","v":{"$error":"#REF!"}},{"$f":"IF(COUNTIF($B$58:$K$59,B21)=1,HLOOKUP(B21,$B$58:$K$59,2,FALSE),IF(COUNTIF($B$60:$K$61,B21)=1,HLOOKUP(B21,$B$60:$K$61,2,FALSE),HLOOKUP(B21,#REF!,2,FALSE)))","v":{"$error":"#REF!"}},{"$f":"IF(COUNTIF($B$66:$K$67,B21)=1,HLOOKUP(B21,$B$66:$K$67,2,FALSE),IF(COUNTIF($B$68:$K$69,B21)=1,HLOOKUP(B21,$B$68:$K$69,2,FALSE),HLOOKUP(B21,#REF!,2,FALSE)))","v":{"$error":"#REF!"}},{"$f":"IF(COUNTIF($B$74:$K$75,B21)=1,HLOOKUP(B21,$B$74:$K$75,2,FALSE),IF(COUNTIF($B$76:$K$77,B21)=1,HLOOKUP(B21,$B$76:$K$77,2,FALSE),HLOOKUP(B21,#REF!,2,FALSE)))","v":{"$error":"#REF!"}},{"$f":"IF(COUNTIF($B$82:$K$83,B21)=1,HLOOKUP(B21,$B$82:$K$83,2,FALSE),IF(COUNTIF($B$84:$K$85,B21)=1,HLOOKUP(B21,$B$84:$K$85,2,FALSE),HLOOKUP(B21,#REF!,2,FALSE)))","v":{"$error":"#REF!"}},{"$f":"IF(COUNTIF($B$90:$K$91,B21)=1,HLOOKUP(B21,$B$90:$K$91,2,FALSE),IF(COUNTIF($B$92:$K$93,B21)=1,HLOOKUP(B21,$B$92:$K$93,2,FALSE),HLOOKUP(B21,#REF!,2,FALSE)))","v":{"$error":"#REF!"}},{"$f":"IF(COUNTIF($B$98:$K$99,B21)=1,HLOOKUP(B21,$B$98:$K$99,2,FALSE),IF(COUNTIF($B$100:$K$101,B21)=1,HLOOKUP(B21,$B$100:$K$101,2,FALSE),HLOOKUP(B21,#REF!,2,FALSE)))","v":{"$error":"#REF!"}},{"$f":"IF(COUNTIF($B$106:$K$107,B21)=1,HLOOKUP(B21,$B$106:$K$107,2,FALSE),IF(COUNTIF($B$108:$K$109,B21)=1,HLOOKUP(B21,$B$108:$K$109,2,FALSE),HLOOKUP(B21,#REF!,2,FALSE)))","v":{"$error":"#REF!"}},{"$f":"IF(COUNTIF($B$114:$K$115,B21)=1,HLOOKUP(B21,$B$114:$K$115,2,FALSE),IF(COUNTIF($B$116:$K$117,B21)=1,HLOOKUP(B21,$B$116:$K$117,2,FALSE),HLOOKUP(B21,#REF!,2,FALSE)))","v":{"$error":"#REF!"}},{"$f":"IF(COUNTIF($B$122:$K$123,B21)=1,HLOOKUP(B21,$B$122:$K$123,2,FALSE),IF(COUNTIF($B$124:$K$125,B21)=1,HLOOKUP(B21,$B$124:$K$125,2,FALSE),HLOOKUP(B21,#REF!,2,FALSE)))","v":{"$error":"#REF!"}},{"$f":"IF(COUNTIF($B$130:$K$131,B21)=1,HLOOKUP(B21,$B$130:$K$131,2,FALSE),IF(COUNTIF($B$132:$K$133,B21)=1,HLOOKUP(B21,$B$132:$K$133,2,FALSE),HLOOKUP(B21,#REF!,2,FALSE)))","v":{"$error":"#REF!"}},{"$f":"IF(COUNTIF($B$138:$K$139,B21)=1,HLOOKUP(B21,$B$138:$K$139,2,FALSE),IF(COUNTIF($B$140:$K$141,B21)=1,HLOOKUP(B21,$B$140:$K$141,2,FALSE),HLOOKUP(B21,#REF!,2,FALSE)))","v":{"$error":"#REF!"}},{"$f":"IF(COUNTIF($B$146:$K$147,B21)=1,HLOOKUP(B21,$B$146:$K$147,2,FALSE),IF(COUNTIF($B$148:$K$149,B21)=1,HLOOKUP(B21,$B$148:$K$149,2,FALSE),HLOOKUP(B21,#REF!,2,FALSE)))","v":{"$error":"#REF!"}},{"$error":"#N/A"},null,null,null,{"$error":"#REF!"},{"$error":"#REF!"},{"$f":"COUNTIF($C21:$R21,X$1)","v":0},0,0,0,0,0,0]
[22,"Equipage 22",{"$f":"IF(COUNTIF($B$34:$K$35,B22)=1,HLOOKUP(B22,$B$34:$K$35,2,FALSE),IF(COUNTIF($B$36:$K$37,B22)=1,HLOOKUP(B22,$B$36:$K$37,2,FALSE),HLOOKUP(B22,#REF!,2,FALSE)))","v":{"$error":"#REF!"}},{"$f":"IF(COUNTIF($B$42:$K$43,B22)=1,HLOOKUP(B22,$B$42:$K$43,2,FALSE),IF(COUNTIF($B$44:$K$45,B22)=1,HLOOKUP(B22,$B$44:$K$45,2,FALSE),HLOOKUP(B22,#REF!,2,FALSE)))","v":{"$error":"#REF!"}},{"$f":"IF(COUNTIF($B$50:$K$51,B22)=1,HLOOKUP(B22,$B$50:$K$51,2,FALSE),IF(COUNTIF($B$52:$K$53,B22)=1,HLOOKUP(B22,$B$52:$K$53,2,FALSE),HLOOKUP(B22,#REF!,2,FALSE)))","v":{"$error":"#REF!"}},{"$f":"IF(COUNTIF($B$58:$K$59,B22)=1,HLOOKUP(B22,$B$58:$K$59,2,FALSE),IF(COUNTIF($B$60:$K$61,B22)=1,HLOOKUP(B22,$B$60:$K$61,2,FALSE),HLOOKUP(B22,#REF!,2,FALSE)))","v":{"$error":"#REF!"}},{"$f":"IF(COUNTIF($B$66:$K$67,B22)=1,HLOOKUP(B22,$B$66:$K$67,2,FALSE),IF(COUNTIF($B$68:$K$69,B22)=1,HLOOKUP(B22,$B$68:$K$69,2,FALSE),HLOOKUP(B22,#REF!,2,FALSE)))","v":{"$error":"#REF!"}},{"$f":"IF(COUNTIF($B$74:$K$75,B22)=1,HLOOKUP(B22,$B$74:$K$75,2,FALSE),IF(COUNTIF($B$76:$K$77,B22)=1,HLOOKUP(B22,$B$76:$K$77,2,FALSE),HLOOKUP(B22,#REF!,2,FALSE)))","v":{"$error":"#REF!"}},{"$f":"IF(COUNTIF($B$82:$K$83,B22)=1,HLOOKUP(B22,$B$82:$K$83,2,FALSE),IF(COUNTIF($B$84:$K$85,B22)=1,HLOOKUP(B22,$B$84:$K$85,2,FALSE),HLOOKUP(B22,#REF!,2,FALSE)))","v":{"$error":"#REF!"}},{"$f":"IF(COUNTIF($B$90:$K$91,B22)=1,HLOOKUP(B22,$B$90:$K$91,2,FALSE),IF(COUNTIF($B$92:$K$93,B22)=1,HLOOKUP(B22,$B$92:$K$93,2,FALSE),HLOOKUP(B22,#REF!,2,FALSE)))","v":{"$error":"#REF!"}},{"$f":"IF(COUNTIF($B$98:$K$99,B22)=1,HLOOKUP(B22,$B$98:$K$99,2,FALSE),IF(COUNTIF($B$100:$K$101,B22)=1,HLOOKUP(B22,$B$100:$K$101,2,FALSE),HLOOKUP(B22,#REF!,2,FALSE)))","v":{"$error":"#REF!"}},{"$f":"IF(COUNTIF($B$106:$K$107,B22)=1,HLOOKUP(B22,$B$106:$K$107,2,FALSE),IF(COUNTIF($B$108:$K$109,B22)=1,HLOOKUP(B22,$B$108:$K$109,2,FALSE),HLOOKUP(B22,#REF!,2,FALSE)))","v":{"$error":"#REF!"}},{"$f":"IF(COUNTIF($B$114:$K$115,B22)=1,HLOOKUP(B22,$B$114:$K$115,2,FALSE),IF(COUNTIF($B$116:$K$117,B22)=1,HLOOKUP(B22,$B$116:$K$117,2,FALSE),HLOOKUP(B22,#REF!,2,FALSE)))","v":{"$error":"#REF!"}},{"$f":"IF(COUNTIF($B$122:$K$123,B22)=1,HLOOKUP(B22,$B$122:$K$123,2,FALSE),IF(COUNTIF($B$124:$K$125,B22)=1,HLOOKUP(B22,$B$124:$K$125,2,FALSE),HLOOKUP(B22,#REF!,2,FALSE)))","v":{"$error":"#REF!"}},{"$f":"IF(COUNTIF($B$130:$K$131,B22)=1,HLOOKUP(B22,$B$130:$K$131,2,FALSE),IF(COUNTIF($B$132:$K$133,B22)=1,HLOOKUP(B22,$B$132:$K$133,2,FALSE),HLOOKUP(B22,#REF!,2,FALSE)))","v":{"$error":"#REF!"}},{"$f":"IF(COUNTIF($B$138:$K$139,B22)=1,HLOOKUP(B22,$B$138:$K$139,2,FALSE),IF(COUNTIF($B$140:$K$141,B22)=1,HLOOKUP(B22,$B$140:$K$141,2,FALSE),HLOOKUP(B22,#REF!,2,FALSE)))","v":{"$error":"#REF!"}},{"$f":"IF(COUNTIF($B$146:$K$147,B22)=1,HLOOKUP(B22,$B$146:$K$147,2,FALSE),IF(COUNTIF($B$148:$K$149,B22)=1,HLOOKUP(B22,$B$148:$K$149,2,FALSE),HLOOKUP(B22,#REF!,2,FALSE)))","v":{"$error":"#REF!"}},{"$error":"#N/A"},null,null,null,{"$error":"#REF!"},{"$error":"#REF!"},0,0,0,0,0,0,0]
[23,"Equipage 23",{"$f":"IF(COUNTIF($B$34:$K$35,B23)=1,HLOOKUP(B23,$B$34:$K$35,2,FALSE),IF(COUNTIF($B$36:$K$37,B23)=1,HLOOKUP(B23,$B$36:$K$37,2,FALSE),HLOOKUP(B23,#REF!,2,FALSE)))","v":{"$error":"#REF!"}},{"$f":"IF(COUNTIF($B$42:$K$43,B23)=1,HLOOKUP(B23,$B$42:$K$43,2,FALSE),IF(COUNTIF($B$44:$K$45,B23)=1,HLOOKUP(B23,$B$44:$K$45,2,FALSE),HLOOKUP(B23,#REF!,2,FALSE)))","v":{"$error":"#REF!"}},{"$f":"IF(COUNTIF($B$50:$K$51,B23)=1,HLOOKUP(B23,$B$50:$K$51,2,FALSE),IF(COUNTIF($B$52:$K$53,B23)=1,HLOOKUP(B23,$B$52:$K$53,2,FALSE),HLOOKUP(B23,#REF!,2,FALSE)))","v":{"$error":"#REF!"}},{"$f":"IF(COUNTIF($B$58:$K$59,B23)=1,HLOOKUP(B23,$B$58:$K$59,2,FALSE),IF(COUNTIF($B$60:$K$61,B23)=1,HLOOKUP(B23,$B$60:$K$61,2,FALSE),HLOOKUP(B23,#REF!,2,FALSE)))","v":{"$error":"#REF!"}},{"$f":"IF(COUNTIF($B$66:$K$67,B23)=1,HLOOKUP(B23,$B$66:$K$67,2,FALSE),IF(COUNTIF($B$68:$K$69,B23)=1,HLOOKUP(B23,$B$68:$K$69,2,FALSE),HLOOKUP(B23,#REF!,2,FALSE)))","v":{"$error":"#REF!"}},{"$f":"IF(COUNTIF($B$74:$K$75,B23)=1,HLOOKUP(B23,$B$74:$K$75,2,FALSE),IF(COUNTIF($B$76:$K$77,B23)=1,HLOOKUP(B23,$B$76:$K$77,2,FALSE),HLOOKUP(B23,#REF!,2,FALSE)))","v":{"$error":"#REF!"}},{"$f":"IF(COUNTIF($B$82:$K$83,B23)=1,HLOOKUP(B23,$B$82:$K$83,2,FALSE),IF(COUNTIF($B$84:$K$85,B23)=1,HLOOKUP(B23,$B$84:$K$85,2,FALSE),HLOOKUP(B23,#REF!,2,FALSE)))","v":{"$error":"#REF!"}},{"$f":"IF(COUNTIF($B$90:$K$91,B23)=1,HLOOKUP(B23,$B$90:$K$91,2,FALSE),IF(COUNTIF($B$92:$K$93,B23)=1,HLOOKUP(B23,$B$92:$K$93,2,FALSE),HLOOKUP(B23,#REF!,2,FALSE)))","v":{"$error":"#REF!"}},{"$f":"IF(COUNTIF($B$98:$K$99,B23)=1,HLOOKUP(B23,$B$98:$K$99,2,FALSE),IF(COUNTIF($B$100:$K$101,B23)=1,HLOOKUP(B23,$B$100:$K$101,2,FALSE),HLOOKUP(B23,#REF!,2,FALSE)))","v":{"$error":"#REF!"}},{"$f":"IF(COUNTIF($B$106:$K$107,B23)=1,HLOOKUP(B23,$B$106:$K$107,2,FALSE),IF(COUNTIF($B$108:$K$109,B23)=1,HLOOKUP(B23,$B$108:$K$109,2,FALSE),HLOOKUP(B23,#REF!,2,FALSE)))","v":{"$error":"#REF!"}},{"$f":"IF(COUNTIF($B$114:$K$115,B23)=1,HLOOKUP(B23,$B$114:$K$115,2,FALSE),IF(COUNTIF($B$116:$K$117,B23)=1,HLOOKUP(B23,$B$116:$K$117,2,FALSE),HLOOKUP(B23,#REF!,2,FALSE)))","v":{"$error":"#REF!"}},{"$f":"IF(COUNTIF($B$122:$K$123,B23)=1,HLOOKUP(B23,$B$122:$K$123,2,FALSE),IF(COUNTIF($B$124:$K$125,B23)=1,HLOOKUP(B23,$B$124:$K$125,2,FALSE),HLOOKUP(B23,#REF!,2,FALSE)))","v":{"$error":"#REF!"}},{"$f":"IF(COUNTIF($B$130:$K$131,B23)=1,HLOOKUP(B23,$B$130:$K$131,2,FALSE),IF(COUNTIF($B$132:$K$133,B23)=1,HLOOKUP(B23,$B$132:$K$133,2,FALSE),HLOOKUP(B23,#REF!,2,FALSE)))","v":{"$error":"#REF!"}},{"$f":"IF(COUNTIF($B$138:$K$139,B23)=1,HLOOKUP(B23,$B$138:$K$139,2,FALSE),IF(COUNTIF($B$140:$K$141,B23)=1,HLOOKUP(B23,$B$140:$K$141,2,FALSE),HLOOKUP(B23,#REF!,2,FALSE)))","v":{"$error":"#REF!"}},{"$f":"IF(COUNTIF($B$146:$K$147,B23)=1,HLOOKUP(B23,$B$146:$K$147,2,FALSE),IF(COUNTIF($B$148:$K$149,B23)=1,HLOOKUP(B23,$B$148:$K$149,2,FALSE),HLOOKUP(B23,#REF!,2,FALSE)))","v":{"$error":"#REF!"}},{"$error":"#N/A"},null,null,null,{"$error":"#REF!"},{"$error":"#REF!"},0,0,0,0,0,0,0]
[24,"Equipage 24",{"$f":"IF(COUNTIF($B$34:$K$35,B24)=1,HLOOKUP(B24,$B$34:$K$35,2,FALSE),IF(COUNTIF($B$36:$K$37,B24)=1,HLOOKUP(B24,$B$36:$K$37,2,FALSE),HLOOKUP(B24,#REF!,2,FALSE)))","v":{"$error":"#REF!"}},{"$f":"IF(COUNTIF($B$42:$K$43,B24)=1,HLOOKUP(B24,$B$42:$K$43,2,FALSE),IF(COUNTIF($B$44:$K$45,B24)=1,HLOOKUP(B24,$B$44:$K$45,2,FALSE),HLOOKUP(B24,#REF!,2,FALSE)))","v":{"$error":"#REF!"}},{"$f":"IF(COUNTIF($B$50:$K$51,B24)=1,HLOOKUP(B24,$B$50:$K$51,2,FALSE),IF(COUNTIF($B$52:$K$53,B24)=1,HLOOKUP(B24,$B$52:$K$53,2,FALSE),HLOOKUP(B24,#REF!,2,FALSE)))","v":{"$error":"#REF!"}},{"$f":"IF(COUNTIF($B$58:$K$59,B24)=1,HLOOKUP(B24,$B$58:$K$59,2,FALSE),IF(COUNTIF($B$60:$K$61,B24)=1,HLOOKUP(B24,$B$60:$K$61,2,FALSE),HLOOKUP(B24,#REF!,2,FALSE)))","v":{"$error":"#REF!"}},{"$f":"IF(COUNTIF($B$66:$K$67,B24)=1,HLOOKUP(B24,$B$66:$K$67,2,FALSE),IF(COUNTIF($B$68:$K$69,B24)=1,HLOOKUP(B24,$B$68:$K$69,2,FALSE),HLOOKUP(B24,#REF!,2,FALSE)))","v":{"$error":"#REF!"}},{"$f":"IF(COUNTIF($B$74:$K$75,B24)=1,HLOOKUP(B24,$B$74:$K$75,2,FALSE),IF(COUNTIF($B$76:$K$77,B24)=1,HLOOKUP(B24,$B$76:$K$77,2,FALSE),HLOOKUP(B24,#REF!,2,FALSE)))","v":{"$error":"#REF!"}},{"$f":"IF(COUNTIF($B$82:$K$83,B24)=1,HLOOKUP(B24,$B$82:$K$83,2,FALSE),IF(COUNTIF($B$84:$K$85,B24)=1,HLOOKUP(B24,$B$84:$K$85,2,FALSE),HLOOKUP(B24,#REF!,2,FALSE)))","v":{"$error":"#REF!"}},{"$f":"IF(COUNTIF($B$90:$K$91,B24)=1,HLOOKUP(B24,$B$90:$K$91,2,FALSE),IF(COUNTIF($B$92:$K$93,B24)=1,HLOOKUP(B24,$B$92:$K$93,2,FALSE),HLOOKUP(B24,#REF!,2,FALSE)))","v":{"$error":"#REF!"}},{"$f":"IF(COUNTIF($B$98:$K$99,B24)=1,HLOOKUP(B24,$B$98:$K$99,2,FALSE),IF(COUNTIF($B$100:$K$101,B24)=1,HLOOKUP(B24,$B$100:$K$101,2,FALSE),HLOOKUP(B24,#REF!,2,FALSE)))","v":{"$error":"#REF!"}},{"$f":"IF(COUNTIF($B$106:$K$107,B24)=1,HLOOKUP(B24,$B$106:$K$107,2,FALSE),IF(COUNTIF($B$108:$K$109,B24)=1,HLOOKUP(B24,$B$108:$K$109,2,FALSE),HLOOKUP(B24,#REF!,2,FALSE)))","v":{"$error":"#REF!"}},{"$f":"IF(COUNTIF($B$114:$K$115,B24)=1,HLOOKUP(B24,$B$114:$K$115,2,FALSE),IF(COUNTIF($B$116:$K$117,B24)=1,HLOOKUP(B24,$B$116:$K$117,2,FALSE),HLOOKUP(B24,#REF!,2,FALSE)))","v":{"$error":"#REF!"}},{"$f":"IF(COUNTIF($B$122:$K$123,B24)=1,HLOOKUP(B24,$B$122:$K$123,2,FALSE),IF(COUNTIF($B$124:$K$125,B24)=1,HLOOKUP(B24,$B$124:$K$125,2,FALSE),HLOOKUP(B24,#REF!,2,FALSE)))","v":{"$error":"#REF!"}},{"$f":"IF(COUNTIF($B$130:$K$131,B24)=1,HLOOKUP(B24,$B$130:$K$131,2,FALSE),IF(COUNTIF($B$132:$K$133,B24)=1,HLOOKUP(B24,$B$132:$K$133,2,FALSE),HLOOKUP(B24,#REF!,2,FALSE)))","v":{"$error":"#REF!"}},{"$f":"IF(COUNTIF($B$138:$K$139,B24)=1,HLOOKUP(B24,$B$138:$K$139,2,FALSE),IF(COUNTIF($B$140:$K$141,B24)=1,HLOOKUP(B24,$B$140:$K$141,2,FALSE),HLOOKUP(B24,#REF!,2,FALSE)))","v":{"$error":"#REF!"}},{"$f":"IF(COUNTIF($B$146:$K$147,B24)=1,HLOOKUP(B24,$B$146:$K$147,2,FALSE),IF(COUNTIF($B$148:$K$149,B24)=1,HLOOKUP(B24,$B$148:$K$149,2,FALSE),HLOOKUP(B24,#REF!,2,FALSE)))","v":{"$error":"#REF!"}},{"$error":"#N/A"},null,null,null,{"$error":"#REF!"},{"$error":"#REF!"},0,0,0,0,0,0,0]
[25,"Equipage 25",{"$f":"IF(COUNTIF($B$34:$K$35,B25)=1,HLOOKUP(B25,$B$34:$K$35,2,FALSE),IF(COUNTIF($B$36:$K$37,B25)=1,HLOOKUP(B25,$B$36:$K$37,2,FALSE),HLOOKUP(B25,#REF!,2,FALSE)))","v":{"$error":"#REF!"}},{"$f":"IF(COUNTIF($B$42:$K$43,B25)=1,HLOOKUP(B25,$B$42:$K$43,2,FALSE),IF(COUNTIF($B$44:$K$45,B25)=1,HLOOKUP(B25,$B$44:$K$45,2,FALSE),HLOOKUP(B25,#REF!,2,FALSE)))","v":{"$error":"#REF!"}},{"$f":"IF(COUNTIF($B$50:$K$51,B25)=1,HLOOKUP(B25,$B$50:$K$51,2,FALSE),IF(COUNTIF($B$52:$K$53,B25)=1,HLOOKUP(B25,$B$52:$K$53,2,FALSE),HLOOKUP(B25,#REF!,2,FALSE)))","v":{"$error":"#REF!"}},{"$f":"IF(COUNTIF($B$58:$K$59,B25)=1,HLOOKUP(B25,$B$58:$K$59,2,FALSE),IF(COUNTIF($B$60:$K$61,B25)=1,HLOOKUP(B25,$B$60:$K$61,2,FALSE),HLOOKUP(B25,#REF!,2,FALSE)))","v":{"$error":"#REF!"}},{"$f":"IF(COUNTIF($B$66:$K$67,B25)=1,HLOOKUP(B25,$B$66:$K$67,2,FALSE),IF(COUNTIF($B$68:$K$69,B25)=1,HLOOKUP(B25,$B$68:$K$69,2,FALSE),HLOOKUP(B25,#REF!,2,FALSE)))","v":{"$error":"#REF!"}},{"$f":"IF(COUNTIF($B$74:$K$75,B25)=1,HLOOKUP(B25,$B$74:$K$75,2,FALSE),IF(COUNTIF($B$76:$K$77,B25)=1,HLOOKUP(B25,$B$76:$K$77,2,FALSE),HLOOKUP(B25,#REF!,2,FALSE)))","v":{"$error":"#REF!"}},{"$f":"IF(COUNTIF($B$82:$K$83,B25)=1,HLOOKUP(B25,$B$82:$K$83,2,FALSE),IF(COUNTIF($B$84:$K$85,B25)=1,HLOOKUP(B25,$B$84:$K$85,2,FALSE),HLOOKUP(B25,#REF!,2,FALSE)))","v":{"$error":"#REF!"}},{"$f":"IF(COUNTIF($B$90:$K$91,B25)=1,HLOOKUP(B25,$B$90:$K$91,2,FALSE),IF(COUNTIF($B$92:$K$93,B25)=1,HLOOKUP(B25,$B$92:$K$93,2,FALSE),HLOOKUP(B25,#REF!,2,FALSE)))","v":{"$error":"#REF!"}},{"$f":"IF(COUNTIF($B$98:$K$99,B25)=1,HLOOKUP(B25,$B$98:$K$99,2,FALSE),IF(COUNTIF($B$100:$K$101,B25)=1,HLOOKUP(B25,$B$100:$K$101,2,FALSE),HLOOKUP(B25,#REF!,2,FALSE)))","v":{"$error":"#REF!"}},{"$f":"IF(COUNTIF($B$106:$K$107,B25)=1,HLOOKUP(B25,$B$106:$K$107,2,FALSE),IF(COUNTIF($B$108:$K$109,B25)=1,HLOOKUP(B25,$B$108:$K$109,2,FALSE),HLOOKUP(B25,#REF!,2,FALSE)))","v":{"$error":"#REF!"}},{"$f":"IF(COUNTIF($B$114:$K$115,B25)=1,HLOOKUP(B25,$B$114:$K$115,2,FALSE),IF(COUNTIF($B$116:$K$117,B25)=1,HLOOKUP(B25,$B$116:$K$117,2,FALSE),HLOOKUP(B25,#REF!,2,FALSE)))","v":{"$error":"#REF!"}},{"$f":"IF(COUNTIF($B$122:$K$123,B25)=1,HLOOKUP(B25,$B$122:$K$123,2,FALSE),IF(COUNTIF($B$124:$K$125,B25)=1,HLOOKUP(B25,$B$124:$K$125,2,FALSE),HLOOKUP(B25,#REF!,2,FALSE)))","v":{"$error":"#REF!"}},{"$f":"IF(COUNTIF($B$130:$K$131,B25)=1,HLOOKUP(B25,$B$130:$K$131,2,FALSE),IF(COUNTIF($B$132:$K$133,B25)=1,HLOOKUP(B25,$B$132:$K$133,2,FALSE),HLOOKUP(B25,#REF!,2,FALSE)))","v":{"$error":"#REF!"}},{"$f":"IF(COUNTIF($B$138:$K$139,B25)=1,HLOOKUP(B25,$B$138:$K$139,2,FALSE),IF(COUNTIF($B$140:$K$141,B25)=1,HLOOKUP(B25,$B$140:$K$141,2,FALSE),HLOOKUP(B25,#REF!,2,FALSE)))","v":{"$error":"#REF!"}},{"$f":"IF(COUNTIF($B$146:$K$147,B25)=1,HLOOKUP(B25,$B$146:$K$147,2,FALSE),IF(COUNTIF($B$148:$K$149,B25)=1,HLOOKUP(B25,$B$148:$K$149,2,FALSE),HLOOKUP(B25,#REF!,2,FALSE)))","v":{"$error":"#REF!"}},{"$error":"#N/A"},null,null,null,{"$error":"#REF!"},{"$error":"#REF!"},0,0,0,0,0,0,0]
[26,"Equipage 26",{"$f":"IF(COUNTIF($B$34:$K$35,B26)=1,HLOOKUP(B26,$B$34:$K$35,2,FALSE),IF(COUNTIF($B$36:$K$37,B26)=1,HLOOKUP(B26,$B$36:$K$37,2,FALSE),HLOOKUP(B26,#REF!,2,FALSE)))","v":{"$error":"#REF!"}},{"$f":"IF(COUNTIF($B$42:$K$43,B26)=1,HLOOKUP(B26,$B$42:$K$43,2,FALSE),IF(COUNTIF($B$44:$K$45,B26)=1,HLOOKUP(B26,$B$44:$K$45,2,FALSE),HLOOKUP(B26,#REF!,2,FALSE)))","v":{"$error":"#REF!"}},{"$f":"IF(COUNTIF($B$50:$K$51,B26)=1,HLOOKUP(B26,$B$50:$K$51,2,FALSE),IF(COUNTIF($B$52:$K$53,B26)=1,HLOOKUP(B26,$B$52:$K$53,2,FALSE),HLOOKUP(B26,#REF!,2,FALSE)))","v":{"$error":"#REF!"}},{"$f":"IF(COUNTIF($B$58:$K$59,B26)=1,HLOOKUP(B26,$B$58:$K$59,2,FALSE),IF(COUNTIF($B$60:$K$61,B26)=1,HLOOKUP(B26,$B$60:$K$61,2,FALSE),HLOOKUP(B26,#REF!,2,FALSE)))","v":{"$error":"#REF!"}},{"$f":"IF(COUNTIF($B$66:$K$67,B26)=1,HLOOKUP(B26,$B$66:$K$67,2,FALSE),IF(COUNTIF($B$68:$K$69,B26)=1,HLOOKUP(B26,$B$68:$K$69,2,FALSE),HLOOKUP(B26,#REF!,2,FALSE)))","v":{"$error":"#REF!"}},{"$f":"IF(COUNTIF($B$74:$K$75,B26)=1,HLOOKUP(B26,$B$74:$K$75,2,FALSE),IF(COUNTIF($B$76:$K$77,B26)=1,HLOOKUP(B26,$B$76:$K$77,2,FALSE),HLOOKUP(B26,#REF!,2,FALSE)))","v":{"$error":"#REF!"}},{"$f":"IF(COUNTIF($B$82:$K$83,B26)=1,HLOOKUP(B26,$B$82:$K$83,2,FALSE),IF(COUNTIF($B$84:$K$85,B26)=1,HLOOKUP(B26,$B$84:$K$85,2,FALSE),HLOOKUP(B26,#REF!,2,FALSE)))","v":{"$error":"#REF!"}},{"$f":"IF(COUNTIF($B$90:$K$91,B26)=1,HLOOKUP(B26,$B$90:$K$91,2,FALSE),IF(COUNTIF($B$92:$K$93,B26)=1,HLOOKUP(B26,$B$92:$K$93,2,FALSE),HLOOKUP(B26,#REF!,2,FALSE)))","v":{"$error":"#REF!"}},{"$f":"IF(COUNTIF($B$98:$K$99,B26)=1,HLOOKUP(B26,$B$98:$K$99,2,FALSE),IF(COUNTIF($B$100:$K$101,B26)=1,HLOOKUP(B26,$B$100:$K$101,2,FALSE),HLOOKUP(B26,#REF!,2,FALSE)))","v":{"$error":"#REF!"}},{"$f":"IF(COUNTIF($B$106:$K$107,B26)=1,HLOOKUP(B26,$B$106:$K$107,2,FALSE),IF(COUNTIF($B$108:$K$109,B26)=1,HLOOKUP(B26,$B$108:$K$109,2,FALSE),HLOOKUP(B26,#REF!,2,FALSE)))","v":{"$error":"#REF!"}},{"$f":"IF(COUNTIF($B$114:$K$115,B26)=1,HLOOKUP(B26,$B$114:$K$115,2,FALSE),IF(COUNTIF($B$116:$K$117,B26)=1,HLOOKUP(B26,$B$116:$K$117,2,FALSE),HLOOKUP(B26,#REF!,2,FALSE)))","v":{"$error":"#REF!"}},{"$f":"IF(COUNTIF($B$122:$K$123,B26)=1,HLOOKUP(B26,$B$122:$K$123,2,FALSE),IF(COUNTIF($B$124:$K$125,B26)=1,HLOOKUP(B26,$B$124:$K$125,2,FALSE),HLOOKUP(B26,#REF!,2,FALSE)))","v":{"$error":"#REF!"}},{"$f":"IF(COUNTIF($B$130:$K$131,B26)=1,HLOOKUP(B26,$B$130:$K$131,2,FALSE),IF(COUNTIF($B$132:$K$133,B26)=1,HLOOKUP(B26,$B$132:$K$133,2,FALSE),HLOOKUP(B26,#REF!,2,FALSE)))","v":{"$error":"#REF!"}},{"$f":"IF(COUNTIF($B$138:$K$139,B26)=1,HLOOKUP(B26,$B$138:$K$139,2,FALSE),IF(COUNTIF($B$140:$K$141,B26)=1,HLOOKUP(B26,$B$140:$K$141,2,FALSE),HLOOKUP(B26,#REF!,2,FALSE)))","v":{"$error":"#REF!"}},{"$f":"IF(COUNTIF($B$146:$K$147,B26)=1,HLOOKUP(B26,$B$146:$K$147,2,FALSE),IF(COUNTIF($B$148:$K$149,B26)=1,HLOOKUP(B26,$B$148:$K$149,2,FALSE),HLOOKUP(B26,#REF!,2,FALSE)))","v":{"$error":"#REF!"}},{"$error":"#N/A"},null,null,null,{"$error":"#REF!"},{"$error":"#REF!"},0,0,0,0,0,0,0]
[27,"Equipage 27",{"$f":"IF(COUNTIF($B$34:$K$35,B27)=1,HLOOKUP(B27,$B$34:$K$35,2,FALSE),IF(COUNTIF($B$36:$K$37,B27)=1,HLOOKUP(B27,$B$36:$K$37,2,FALSE),HLOOKUP(B27,#REF!,2,FALSE)))","v":{"$error":"#REF!"}},{"$f":"IF(COUNTIF($B$42:$K$43,B27)=1,HLOOKUP(B27,$B$42:$K$43,2,FALSE),IF(COUNTIF($B$44:$K$45,B27)=1,HLOOKUP(B27,$B$44:$K$45,2,FALSE),HLOOKUP(B27,#REF!,2,FALSE)))","v":{"$error":"#REF!"}},{"$f":"IF(COUNTIF($B$50:$K$51,B27)=1,HLOOKUP(B27,$B$50:$K$51,2,FALSE),IF(COUNTIF($B$52:$K$53,B27)=1,HLOOKUP(B27,$B$52:$K$53,2,FALSE),HLOOKUP(B27,#REF!,2,FALSE)))","v":{"$error":"#REF!"}},{"$f":"IF(COUNTIF($B$58:$K$59,B27)=1,HLOOKUP(B27,$B$58:$K$59,2,FALSE),IF(COUNTIF($B$60:$K$61,B27)=1,HLOOKUP(B27,$B$60:$K$61,2,FALSE),HLOOKUP(B27,#REF!,2,FALSE)))","v":{"$error":"#REF!"}},{"$f":"IF(COUNTIF($B$66:$K$67,B27)=1,HLOOKUP(B27,$B$66:$K$67,2,FALSE),IF(COUNTIF($B$68:$K$69,B27)=1,HLOOKUP(B27,$B$68:$K$69,2,FALSE),HLOOKUP(B27,#REF!,2,FALSE)))","v":{"$error":"#REF!"}},{"$f":"IF(COUNTIF($B$74:$K$75,B27)=1,HLOOKUP(B27,$B$74:$K$75,2,FALSE),IF(COUNTIF($B$76:$K$77,B27)=1,HLOOKUP(B27,$B$76:$K$77,2,FALSE),HLOOKUP(B27,#REF!,2,FALSE)))","v":{"$error":"#REF!"}},{"$f":"IF(COUNTIF($B$82:$K$83,B27)=1,HLOOKUP(B27,$B$82:$K$83,2,FALSE),IF(COUNTIF($B$84:$K$85,B27)=1,HLOOKUP(B27,$B$84:$K$85,2,FALSE),HLOOKUP(B27,#REF!,2,FALSE)))","v":{"$error":"#REF!"}},{"$f":"IF(COUNTIF($B$90:$K$91,B27)=1,HLOOKUP(B27,$B$90:$K$91,2,FALSE),IF(COUNTIF($B$92:$K$93,B27)=1,HLOOKUP(B27,$B$92:$K$93,2,FALSE),HLOOKUP(B27,#REF!,2,FALSE)))","v":{"$error":"#REF!"}},{"$f":"IF(COUNTIF($B$98:$K$99,B27)=1,HLOOKUP(B27,$B$98:$K$99,2,FALSE),IF(COUNTIF($B$100:$K$101,B27)=1,HLOOKUP(B27,$B$100:$K$101,2,FALSE),HLOOKUP(B27,#REF!,2,FALSE)))","v":{"$error":"#REF!"}},{"$f":"IF(COUNTIF($B$106:$K$107,B27)=1,HLOOKUP(B27,$B$106:$K$107,2,FALSE),IF(COUNTIF($B$108:$K$109,B27)=1,HLOOKUP(B27,$B$108:$K$109,2,FALSE),HLOOKUP(B27,#REF!,2,FALSE)))","v":{"$error":"#REF!"}},{"$f":"IF(COUNTIF($B$114:$K$115,B27)=1,HLOOKUP(B27,$B$114:$K$115,2,FALSE),IF(COUNTIF($B$116:$K$117,B27)=1,HLOOKUP(B27,$B$116:$K$117,2,FALSE),HLOOKUP(B27,#REF!,2,FALSE)))","v":{"$error":"#REF!"}},{"$f":"IF(COUNTIF($B$122:$K$123,B27)=1,HLOOKUP(B27,$B$122:$K$123,2,FALSE),IF(COUNTIF($B$124:$K$125,B27)=1,HLOOKUP(B27,$B$124:$K$125,2,FALSE),HLOOKUP(B27,#REF!,2,FALSE)))","v":{"$error":"#REF!"}},{"$f":"IF(COUNTIF($B$130:$K$131,B27)=1,HLOOKUP(B27,$B$130:$K$131,2,FALSE),IF(COUNTIF($B$132:$K$133,B27)=1,HLOOKUP(B27,$B$132:$K$133,2,FALSE),HLOOKUP(B27,#REF!,2,FALSE)))","v":{"$error":"#REF!"}},{"$f":"IF(COUNTIF($B$138:$K$139,B27)=1,HLOOKUP(B27,$B$138:$K$139,2,FALSE),IF(COUNTIF($B$140:$K$141,B27)=1,HLOOKUP(B27,$B$140:$K$141,2,FALSE),HLOOKUP(B27,#REF!,2,FALSE)))","v":{"$error":"#REF!"}},{"$f":"IF(COUNTIF($B$146:$K$147,B27)=1,HLOOKUP(B27,$B$146:$K$147,2,FALSE),IF(COUNTIF($B$148:$K$149,B27)=1,HLOOKUP(B27,$B$148:$K$149,2,FALSE),HLOOKUP(B27,#REF!,2,FALSE)))","v":{"$error":"#REF!"}},{"$error":"#N/A"},null,null,null,{"$error":"#REF!"},{"$error":"#REF!"},0,0,0,0,0,0,0]
[28,"Equipage 28",{"$f":"IF(COUNTIF($B$34:$K$35,B28)=1,HLOOKUP(B28,$B$34:$K$35,2,FALSE),IF(COUNTIF($B$36:$K$37,B28)=1,HLOOKUP(B28,$B$36:$K$37,2,FALSE),HLOOKUP(B28,#REF!,2,FALSE)))","v":{"$error":"#REF!"}},{"$f":"IF(COUNTIF($B$42:$K$43,B28)=1,HLOOKUP(B28,$B$42:$K$43,2,FALSE),IF(COUNTIF($B$44:$K$45,B28)=1,HLOOKUP(B28,$B$44:$K$45,2,FALSE),HLOOKUP(B28,#REF!,2,FALSE)))","v":{"$error":"#REF!"}},{"$f":"IF(COUNTIF($B$50:$K$51,B28)=1,HLOOKUP(B28,$B$50:$K$51,2,FALSE),IF(COUNTIF($B$52:$K$53,B28)=1,HLOOKUP(B28,$B$52:$K$53,2,FALSE),HLOOKUP(B28,#REF!,2,FALSE)))","v":{"$error":"#REF!"}},{"$f":"IF(COUNTIF($B$58:$K$59,B28)=1,HLOOKUP(B28,$B$58:$K$59,2,FALSE),IF(COUNTIF($B$60:$K$61,B28)=1,HLOOKUP(B28,$B$60:$K$61,2,FALSE),HLOOKUP(B28,#REF!,2,FALSE)))","v":{"$error":"#REF!"}},{"$f":"IF(COUNTIF($B$66:$K$67,B28)=1,HLOOKUP(B28,$B$66:$K$67,2,FALSE),IF(COUNTIF($B$68:$K$69,B28)=1,HLOOKUP(B28,$B$68:$K$69,2,FALSE),HLOOKUP(B28,#REF!,2,FALSE)))","v":{"$error":"#REF!"}},{"$f":"IF(COUNTIF($B$74:$K$75,B28)=1,HLOOKUP(B28,$B$74:$K$75,2,FALSE),IF(COUNTIF($B$76:$K$77,B28)=1,HLOOKUP(B28,$B$76:$K$77,2,FALSE),HLOOKUP(B28,#REF!,2,FALSE)))","v":{"$error":"#REF!"}},{"$f":"IF(COUNTIF($B$82:$K$83,B28)=1,HLOOKUP(B28,$B$82:$K$83,2,FALSE),IF(COUNTIF($B$84:$K$85,B28)=1,HLOOKUP(B28,$B$84:$K$85,2,FALSE),HLOOKUP(B28,#REF!,2,FALSE)))","v":{"$error":"#REF!"}},{"$f":"IF(COUNTIF($B$90:$K$91,B28)=1,HLOOKUP(B28,$B$90:$K$91,2,FALSE),IF(COUNTIF($B$92:$K$93,B28)=1,HLOOKUP(B28,$B$92:$K$93,2,FALSE),HLOOKUP(B28,#REF!,2,FALSE)))","v":{"$error":"#REF!"}},{"$f":"IF(COUNTIF($B$98:$K$99,B28)=1,HLOOKUP(B28,$B$98:$K$99,2,FALSE),IF(COUNTIF($B$100:$K$101,B28)=1,HLOOKUP(B28,$B$100:$K$101,2,FALSE),HLOOKUP(B28,#REF!,2,FALSE)))","v":{"$error":"#REF!"}},{"$f":"IF(COUNTIF($B$106:$K$107,B28)=1,HLOOKUP(B28,$B$106:$K$107,2,FALSE),IF(COUNTIF($B$108:$K$109,B28)=1,HLOOKUP(B28,$B$108:$K$109,2,FALSE),HLOOKUP(B28,#REF!,2,FALSE)))","v":{"$error":"#REF!"}},{"$f":"IF(COUNTIF($B$114:$K$115,B28)=1,HLOOKUP(B28,$B$114:$K$115,2,FALSE),IF(COUNTIF($B$116:$K$117,B28)=1,HLOOKUP(B28,$B$116:$K$117,2,FALSE),HLOOKUP(B28,#REF!,2,FALSE)))","v":{"$error":"#REF!"}},{"$f":"IF(COUNTIF($B$122:$K$123,B28)=1,HLOOKUP(B28,$B$122:$K$123,2,FALSE),IF(COUNTIF($B$124:$K$125,B28)=1,HLOOKUP(B28,$B$124:$K$125,2,FALSE),HLOOKUP(B28,#REF!,2,FALSE)))","v":{"$error":"#REF!"}},{"$f":"IF(COUNTIF($B$130:$K$131,B28)=1,HLOOKUP(B28,$B$130:$K$131,2,FALSE),IF(COUNTIF($B$132:$K$133,B28)=1,HLOOKUP(B28,$B$132:$K$133,2,FALSE),HLOOKUP(B28,#REF!,2,FALSE)))","v":{"$error":"#REF!"}},{"$f":"IF(COUNTIF($B$138:$K$139,B28)=1,HLOOKUP(B28,$B$138:$K$139,2,FALSE),IF(COUNTIF($B$140:$K$141,B28)=1,HLOOKUP(B28,$B$140:$K$141,2,FALSE),HLOOKUP(B28,#REF!,2,FALSE)))","v":{"$error":"#REF!"}},{"$f":"IF(COUNTIF($B$146:$K$147,B28)=1,HLOOKUP(B28,$B$146:$K$147,2,FALSE),IF(COUNTIF($B$148:$K$149,B28)=1,HLOOKUP(B28,$B$148:$K$149,2,FALSE),HLOOKUP(B28,#REF!,2,FALSE)))","v":{"$error":"#REF!"}},{"$error":"#N/A"},null,null,null,{"$error":"#REF!"},{"$error":"#REF!"},0,0,0,0,0,0,0]
[29,"Equipage 29",{"$f":"IF(COUNTIF($B$34:$K$35,B29)=1,HLOOKUP(B29,$B$34:$K$35,2,FALSE),IF(COUNTIF($B$36:$K$37,B29)=1,HLOOKUP(B29,$B$36:$K$37,2,FALSE),HLOOKUP(B29,#REF!,2,FALSE)))","v":{"$error":"#REF!"}},{"$f":"IF(COUNTIF($B$42:$K$43,B29)=1,HLOOKUP(B29,$B$42:$K$43,2,FALSE),IF(COUNTIF($B$44:$K$45,B29)=1,HLOOKUP(B29,$B$44:$K$45,2,FALSE),HLOOKUP(B29,#REF!,2,FALSE)))","v":{"$error":"#REF!"}},{"$f":"IF(COUNTIF($B$50:$K$51,B29)=1,HLOOKUP(B29,$B$50:$K$51,2,FALSE),IF(COUNTIF($B$52:$K$53,B29)=1,HLOOKUP(B29,$B$52:$K$53,2,FALSE),HLOOKUP(B29,#REF!,2,FALSE)))","v":{"$error":"#REF!"}},{"$f":"IF(COUNTIF($B$58:$K$59,B29)=1,HLOOKUP(B29,$B$58:$K$59,2,FALSE),IF(COUNTIF($B$60:$K$61,B29)=1,HLOOKUP(B29,$B$60:$K$61,2,FALSE),HLOOKUP(B29,#REF!,2,FALSE)))","v":{"$error":"#REF!"}},{"$f":"IF(COUNTIF($B$66:$K$67,B29)=1,HLOOKUP(B29,$B$66:$K$67,2,FALSE),IF(COUNTIF($B$68:$K$69,B29)=1,HLOOKUP(B29,$B$68:$K$69,2,FALSE),HLOOKUP(B29,#REF!,2,FALSE)))","v":{"$error":"#REF!"}},{"$f":"IF(COUNTIF($B$74:$K$75,B29)=1,HLOOKUP(B29,$B$74:$K$75,2,FALSE),IF(COUNTIF($B$76:$K$77,B29)=1,HLOOKUP(B29,$B$76:$K$77,2,FALSE),HLOOKUP(B29,#REF!,2,FALSE)))","v":{"$error":"#REF!"}},{"$f":"IF(COUNTIF($B$82:$K$83,B29)=1,HLOOKUP(B29,$B$82:$K$83,2,FALSE),IF(COUNTIF($B$84:$K$85,B29)=1,HLOOKUP(B29,$B$84:$K$85,2,FALSE),HLOOKUP(B29,#REF!,2,FALSE)))","v":{"$error":"#REF!"}},{"$f":"IF(COUNTIF($B$90:$K$91,B29)=1,HLOOKUP(B29,$B$90:$K$91,2,FALSE),IF(COUNTIF($B$92:$K$93,B29)=1,HLOOKUP(B29,$B$92:$K$93,2,FALSE),HLOOKUP(B29,#REF!,2,FALSE)))","v":{"$error":"#REF!"}},{"$f":"IF(COUNTIF($B$98:$K$99,B29)=1,HLOOKUP(B29,$B$98:$K$99,2,FALSE),IF(COUNTIF($B$100:$K$101,B29)=1,HLOOKUP(B29,$B$100:$K$101,2,FALSE),HLOOKUP(B29,#REF!,2,FALSE)))","v":{"$error":"#REF!"}},{"$f":"IF(COUNTIF($B$106:$K$107,B29)=1,HLOOKUP(B29,$B$106:$K$107,2,FALSE),IF(COUNTIF($B$108:$K$109,B29)=1,HLOOKUP(B29,$B$108:$K$109,2,FALSE),HLOOKUP(B29,#REF!,2,FALSE)))","v":{"$error":"#REF!"}},{"$f":"IF(COUNTIF($B$114:$K$115,B29)=1,HLOOKUP(B29,$B$114:$K$115,2,FALSE),IF(COUNTIF($B$116:$K$117,B29)=1,HLOOKUP(B29,$B$116:$K$117,2,FALSE),HLOOKUP(B29,#REF!,2,FALSE)))","v":{"$error":"#REF!"}},{"$f":"IF(COUNTIF($B$122:$K$123,B29)=1,HLOOKUP(B29,$B$122:$K$123,2,FALSE),IF(COUNTIF($B$124:$K$125,B29)=1,HLOOKUP(B29,$B$124:$K$125,2,FALSE),HLOOKUP(B29,#REF!,2,FALSE)))","v":{"$error":"#REF!"}},{"$f":"IF(COUNTIF($B$130:$K$131,B29)=1,HLOOKUP(B29,$B$130:$K$131,2,FALSE),IF(COUNTIF($B$132:$K$133,B29)=1,HLOOKUP(B29,$B$132:$K$133,2,FALSE),HLOOKUP(B29,#REF!,2,FALSE)))","v":{"$error":"#REF!"}},{"$f":"IF(COUNTIF($B$138:$K$139,B29)=1,HLOOKUP(B29,$B$138:$K$139,2,FALSE),IF(COUNTIF($B$140:$K$141,B29)=1,HLOOKUP(B29,$B$140:$K$141,2,FALSE),HLOOKUP(B29,#REF!,2,FALSE)))","v":{"$error":"#REF!"}},{"$f":"IF(COUNTIF($B$146:$K$147,B29)=1,HLOOKUP(B29,$B$146:$K$147,2,FALSE),IF(COUNTIF($B$148:$K$149,B29)=1,HLOOKUP(B29,$B$148:$K$149,2,FALSE),HLOOKUP(B29,#REF!,2,FALSE)))","v":{"$error":"#REF!"}},{"$error":"#N/A"},null,null,null,{"$error":"#REF!"},{"$error":"#REF!"},0,0,0,0,0,0,0]
[30,"Equipage 30",{"$f":"IF(COUNTIF($B$34:$K$35,B30)=1,HLOOKUP(B30,$B$34:$K$35,2,FALSE),IF(COUNTIF($B$36:$K$37,B30)=1,HLOOKUP(B30,$B$36:$K$37,2,FALSE),HLOOKUP(B30,#REF!,2,FALSE)))","v":{"$error":"#REF!"}},{"$f":"IF(COUNTIF($B$42:$K$43,B30)=1,HLOOKUP(B30,$B$42:$K$43,2,FALSE),IF(COUNTIF($B$44:$K$45,B30)=1,HLOOKUP(B30,$B$44:$K$45,2,FALSE),HLOOKUP(B30,#REF!,2,FALSE)))","v":{"$error":"#REF!"}},{"$f":"IF(COUNTIF($B$50:$K$51,B30)=1,HLOOKUP(B30,$B$50:$K$51,2,FALSE),IF(COUNTIF($B$52:$K$53,B30)=1,HLOOKUP(B30,$B$52:$K$53,2,FALSE),HLOOKUP(B30,#REF!,2,FALSE)))","v":{"$error":"#REF!"}},{"$f":"IF(COUNTIF($B$58:$K$59,B30)=1,HLOOKUP(B30,$B$58:$K$59,2,FALSE),IF(COUNTIF($B$60:$K$61,B30)=1,HLOOKUP(B30,$B$60:$K$61,2,FALSE),HLOOKUP(B30,#REF!,2,FALSE)))","v":{"$error":"#REF!"}},{"$f":"IF(COUNTIF($B$66:$K$67,B30)=1,HLOOKUP(B30,$B$66:$K$67,2,FALSE),IF(COUNTIF($B$68:$K$69,B30)=1,HLOOKUP(B30,$B$68:$K$69,2,FALSE),HLOOKUP(B30,#REF!,2,FALSE)))","v":{"$error":"#REF!"}},{"$f":"IF(COUNTIF($B$74:$K$75,B30)=1,HLOOKUP(B30,$B$74:$K$75,2,FALSE),IF(COUNTIF($B$76:$K$77,B30)=1,HLOOKUP(B30,$B$76:$K$77,2,FALSE),HLOOKUP(B30,#REF!,2,FALSE)))","v":{"$error":"#REF!"}},{"$f":"IF(COUNTIF($B$82:$K$83,B30)=1,HLOOKUP(B30,$B$82:$K$83,2,FALSE),IF(COUNTIF($B$84:$K$85,B30)=1,HLOOKUP(B30,$B$84:$K$85,2,FALSE),HLOOKUP(B30,#REF!,2,FALSE)))","v":{"$error":"#REF!"}},{"$f":"IF(COUNTIF($B$90:$K$91,B30)=1,HLOOKUP(B30,$B$90:$K$91,2,FALSE),IF(COUNTIF($B$92:$K$93,B30)=1,HLOOKUP(B30,$B$92:$K$93,2,FALSE),HLOOKUP(B30,#REF!,2,FALSE)))","v":{"$error":"#REF!"}},{"$f":"IF(COUNTIF($B$98:$K$99,B30)=1,HLOOKUP(B30,$B$98:$K$99,2,FALSE),IF(COUNTIF($B$100:$K$101,B30)=1,HLOOKUP(B30,$B$100:$K$101,2,FALSE),HLOOKUP(B30,#REF!,2,FALSE)))","v":{"$error":"#REF!"}},{"$f":"IF(COUNTIF($B$106:$K$107,B30)=1,HLOOKUP(B30,$B$106:$K$107,2,FALSE),IF(COUNTIF($B$108:$K$109,B30)=1,HLOOKUP(B30,$B$108:$K$109,2,FALSE),HLOOKUP(B30,#REF!,2,FALSE)))","v":{"$error":"#REF!"}},{"$f":"IF(COUNTIF($B$114:$K$115,B30)=1,HLOOKUP(B30,$B$114:$K$115,2,FALSE),IF(COUNTIF($B$116:$K$117,B30)=1,HLOOKUP(B30,$B$116:$K$117,2,FALSE),HLOOKUP(B30,#REF!,2,FALSE)))","v":{"$error":"#REF!"}},{"$f":"IF(COUNTIF($B$122:$K$123,B30)=1,HLOOKUP(B30,$B$122:$K$123,2,FALSE),IF(COUNTIF($B$124:$K$125,B30)=1,HLOOKUP(B30,$B$124:$K$125,2,FALSE),HLOOKUP(B30,#REF!,2,FALSE)))","v":{"$error":"#REF!"}},{"$f":"IF(COUNTIF($B$130:$K$131,B30)=1,HLOOKUP(B30,$B$130:$K$131,2,FALSE),IF(COUNTIF($B$132:$K$133,B30)=1,HLOOKUP(B30,$B$132:$K$133,2,FALSE),HLOOKUP(B30,#REF!,2,FALSE)))","v":{"$error":"#REF!"}},{"$f":"IF(COUNTIF($B$138:$K$139,B30)=1,HLOOKUP(B30,$B$138:$K$139,2,FALSE),IF(COUNTIF($B$140:$K$141,B30)=1,HLOOKUP(B30,$B$140:$K$141,2,FALSE),HLOOKUP(B30,#REF!,2,FALSE)))","v":{"$error":"#REF!"}},{"$f":"IF(COUNTIF($B$146:$K$147,B30)=1,HLOOKUP(B30,$B$146:$K$147,2,FALSE),IF(COUNTIF($B$148:$K$149,B30)=1,HLOOKUP(B30,$B$148:$K$149,2,FALSE),HLOOKUP(B30,#REF!,2,FALSE)))","v":{"$error":"#REF!"}},{"$error":"#N/A"},null,null,null,{"$error":"#REF!"},{"$error":"#REF!"},0,0,0,0,0,0,0]
[null,null,null,null,null,null,null,null,null,null,null,null,null,null,null,{"$f":"IF(COUNTIF($B$138:$K$139,B31)=1,HLOOKUP(B31,$B$138:$K$139,2,FALSE),IF(COUNTIF($B$140:$K$141,B31)=1,HLOOKUP(B31,$B$140:$K$141,2,FALSE),HLOOKUP(B31,#REF!,2,FALSE)))","v":{"$error":"#REF!"}}]
["Flight 1"]
["Race",{"$f":"'Pairing List calcul'!C1","v":"Boat 1"},{"$f":"'Pairing List calcul'!D1","v":"Boat 2"},{"$f":"'Pairing List calcul'!E1","v":"Boat 3"},{"$f":"'Pairing List calcul'!F1","v":"Boat 4"},{"$f":"'Pairing List calcul'!G1","v":"Boat 5"}]
[1,{"$f":"VLOOKUP(VLOOKUP($A$34,'Pairing List calcul'!$B:$G,COLUMN(),0),$A:$I,2,0)","v":"Equipage 7"},{"$f":"VLOOKUP(VLOOKUP($A$34,'Pairing List calcul'!$B:$G,COLUMN(),0),$A:$I,2,0)","v":"Equipage 10"},{"$f":"VLOOKUP(VLOOKUP($A$34,'Pairing List calcul'!$B:$G,COLUMN(),0),$A:$I,2,0)","v":"Equipage 4"},{"$f":"VLOOKUP(VLOOKUP($A$34,'Pairing List calcul'!$B:$G,COLUMN(),0),$A:$I,2,0)","v":"Equipage 6"},{"$f":"VLOOKUP(VLOOKUP($A$34,'Pairing List calcul'!$B:$G,COLUMN(),0),$A:$I,2,0)","v":"Equipage 1"}]
["Place"]
[2,{"$f":"VLOOKUP(VLOOKUP($A$36,'Pairing List calcul'!$B:$G,COLUMN(),0),$A:$O,2,0)","v":"Equipage 8"},{"$f":"VLOOKUP(VLOOKUP($A$36,'Pairing List calcul'!$B:$G,COLUMN(),0),$A:$O,2,0)","v":"Equipage 5"},{"$f":"VLOOKUP(VLOOKUP($A$36,'Pairing List calcul'!$B:$G,COLUMN(),0),$A:$O,2,0)","v":"Equipage 9"},{"$f":"VLOOKUP(VLOOKUP($A$36,'Pairing List calcul'!$B:$G,COLUMN(),0),$A:$O,2,0)","v":"Equipage 3"},{"$f":"VLOOKUP(VLOOKUP($A$36,'Pairing List calcul'!$B:$G,COLUMN(),0),$A:$O,2,0)","v":"Equipage 2"}]
["Place"]
[null,{"$f":"VLOOKUP(VLOOKUP($A$38,'Pairing List calcul'!$B:$G,COLUMN(),0),$A:$O,2,0)","v":{"$error":"#N/A"}},{"$f":"VLOOKUP(VLOOKUP($A$38,'Pairing List calcul'!$B:$G,COLUMN(),0),$A:$O,2,0)","v":{"$error":"#N/A"}},{"$f":"VLOOKUP(VLOOKUP($A$38,'Pairing List calcul'!$B:$G,COLUMN(),0),$A:$O,2,0)","v":{"$error":"#N/A"}},{"$f":"VLOOKUP(VLOOKUP($A$38,'Pairing List calcul'!$B:$G,COLUMN(),0),$A:$O,2,0)","v":{"$error":"#N/A"}},{"$f":"VLOOKUP(VLOOKUP($A$38,'Pairing List calcul'!$B:$G,COLUMN(),0),$A:$O,2,0)","v":{"$error":"#N/A"}}]
["Place"]
["Flight 2"]
["Race",{"$f":"B33","v":"Boat 1"},"Boat 2","Boat 3","Boat 4","Boat 5"]
[3,{"$f":"VLOOKUP(VLOOKUP($A$42,'Pairing List calcul'!$B:$G,COLUMN(),0),$A:$O,2,0)","v":"Equipage 8"},{"$f":"VLOOKUP(VLOOKUP($A$42,'Pairing List calcul'!$B:$G,COLUMN(),0),$A:$O,2,0)","v":"Equipage 4"},{"$f":"VLOOKUP(VLOOKUP($A$42,'Pairing List calcul'!$B:$G,COLUMN(),0),$A:$O,2,0)","v":"Equipage 9"},{"$f":"VLOOKUP(VLOOKUP($A$42,'Pairing List calcul'!$B:$G,COLUMN(),0),$A:$O,2,0)","v":"Equipage 10"},{"$f":"VLOOKUP(VLOOKUP($A$42,'Pairing List calcul'!$B:$G,COLUMN(),0),$A:$O,2,0)","v":"Equipage 6"}]
["Place"]
[4,{"$f":"VLOOKUP(VLOOKUP($A$44,'Pairing List calcul'!$B:$G,COLUMN(),0),$A:$O,2,0)","v":"Equipage 5"},{"$f":"VLOOKUP(VLOOKUP($A$44,'Pairing List calcul'!$B:$G,COLUMN(),0),$A:$O,2,0)","v":"Equipage 2"},{"$f":"VLOOKUP(VLOOKUP($A$44,'Pairing List calcul'!$B:$G,COLUMN(),0),$A:$O,2,0)","v":"Equipage 3"},{"$f":"VLOOKUP(VLOOKUP($A$44,'Pairing List calcul'!$B:$G,COLUMN(),0),$A:$O,2,0)","v":"Equipage 1"},{"$f":"VLOOKUP(VLOOKUP($A$44,'Pairing List calcul'!$B:$G,COLUMN(),0),$A:$O,2,0)","v":"Equipage 7"}]
["Place"]
[null,{"$f":"VLOOKUP(VLOOKUP($A$46,'Pairing List calcul'!$B:$G,COLUMN(),0),$A:$O,2,0)","v":{"$error":"#N/A"}},{"$f":"VLOOKUP(VLOOKUP($A$46,'Pairing List calcul'!$B:$G,COLUMN(),0),$A:$O,2,0)","v":{"$error":"#N/A"}},{"$f":"VLOOKUP(VLOOKUP($A$46,'Pairing List calcul'!$B:$G,COLUMN(),0),$A:$O,2,0)","v":{"$error":"#N/A"}},{"$f":"VLOOKUP(VLOOKUP($A$46,'Pairing List calcul'!$B:$G,COLUMN(),0),$A:$O,2,0)","v":{"$error":"#N/A"}},{"$f":"VLOOKUP(VLOOKUP($A$46,'Pairing List calcul'!$B:$G,COLUMN(),0),$A:$O,2,0)","v":{"$error":"#N/A"}}]
["Place"]
["Flight 3"]
["Race",{"$f":"B33","v":"Boat 1"},"Boat 2","Boat 3","Boat 4","Boat 5"]
[5,{"$f":"VLOOKUP(VLOOKUP($A$50,'Pairing List calcul'!$B:$G,COLUMN(),0),$A:$O,2,0)","v":"Equipage 5"},{"$f":"VLOOKUP(VLOOKUP($A$50,'Pairing List calcul'!$B:$G,COLUMN(),0),$A:$O,2,0)","v":"Equipage 8"},{"$f":"VLOOKUP(VLOOKUP($A$50,'Pairing List calcul'!$B:$G,COLUMN(),0),$A:$O,2,0)","v":"Equipage 4"},{"$f":"VLOOKUP(VLOOKUP($A$50,'Pairing List calcul'!$B:$G,COLUMN(),0),$A:$O,2,0)","v":"Equipage 10"},{"$f":"VLOOKUP(VLOOKUP($A$50,'Pairing List calcul'!$B:$G,COLUMN(),0),$A:$O,2,0)","v":"Equipage 7"}]
["Place"]
[6,{"$f":"VLOOKUP(VLOOKUP($A$52,'Pairing List calcul'!$B:$G,COLUMN(),0),$A:$O,2,0)","v":"Equipage 1"},{"$f":"VLOOKUP(VLOOKUP($A$52,'Pairing List calcul'!$B:$G,COLUMN(),0),$A:$O,2,0)","v":"Equipage 2"},{"$f":"VLOOKUP(VLOOKUP($A$52,'Pairing List calcul'!$B:$G,COLUMN(),0),$A:$O,2,0)","v":"Equipage 3"},{"$f":"VLOOKUP(VLOOKUP($A$52,'Pairing List calcul'!$B:$G,COLUMN(),0),$A:$O,2,0)","v":"Equipage 9"},{"$f":"VLOOKUP(VLOOKUP($A$52,'Pairing List calcul'!$B:$G,COLUMN(),0),$A:$O,2,0)","v":"Equipage 6"}]
["Place"]
[null,{"$f":"VLOOKUP(VLOOKUP($A$54,'Pairing List calcul'!$B:$G,COLUMN(),0),$A:$O,2,0)","v":{"$error":"#N/A"}},{"$f":"VLOOKUP(VLOOKUP($A$54,'Pairing List calcul'!$B:$G,COLUMN(),0),$A:$O,2,0)","v":{"$error":"#N/A"}},{"$f":"VLOOKUP(VLOOKUP($A$54,'Pairing List calcul'!$B:$G,COLUMN(),0),$A:$O,2,0)","v":{"$error":"#N/A"}},{"$f":"VLOOKUP(VLOOKUP($A$54,'Pairing List calcul'!$B:$G,COLUMN(),0),$A:$O,2,0)","v":{"$error":"#N/A"}},{"$f":"VLOOKUP(VLOOKUP($A$54,'Pairing List calcul'!$B:$G,COLUMN(),0),$A:$O,2,0)","v":{"$error":"#N/A"}}]
["Place"]
["Flight 4"]
["Race",{"$f":"B33","v":"Boat 1"},"Boat 2","Boat 3","Boat 4","Boat 5"]
[7,{"$f":"VLOOKUP(VLOOKUP($A$58,'Pairing List calcul'!$B:$G,COLUMN(),0),$A:$O,2,0)","v":"Equipage 10"},{"$f":"VLOOKUP(VLOOKUP($A$58,'Pairing List calcul'!$B:$G,COLUMN(),0),$A:$O,2,0)","v":"Equipage 7"},{"$f":"VLOOKUP(VLOOKUP($A$58,'Pairing List calcul'!$B:$G,COLUMN(),0),$A:$O,2,0)","v":"Equipage 3"},{"$f":"VLOOKUP(VLOOKUP($A$58,'Pairing List calcul'!$B:$G,COLUMN(),0),$A:$O,2,0)","v":"Equipage 9"},{"$f":"VLOOKUP(VLOOKUP($A$58,'Pairing List calcul'!$B:$G,COLUMN(),0),$A:$O,2,0)","v":"Equipage 6"}]
["Place"]
[8,{"$f":"VLOOKUP(VLOOKUP($A$60,'Pairing List calcul'!$B:$G,COLUMN(),0),$A:$O,2,0)","v":"Equipage 2"},{"$f":"VLOOKUP(VLOOKUP($A$60,'Pairing List calcul'!$B:$G,COLUMN(),0),$A:$O,2,0)","v":"Equipage 4"},{"$f":"VLOOKUP(VLOOKUP($A$60,'Pairing List calcul'!$B:$G,COLUMN(),0),$A:$O,2,0)","v":"Equipage 8"},{"$f":"VLOOKUP(VLOOKUP($A$60,'Pairing List calcul'!$B:$G,COLUMN(),0),$A:$O,2,0)","v":"Equipage 5"},{"$f":"VLOOKUP(VLOOKUP($A$60,'Pairing List calcul'!$B:$G,COLUMN(),0),$A:$O,2,0)","v":"Equipage 1"}]
["Place"]
[null,{"$f":"VLOOKUP(VLOOKUP($A$62,'Pairing List calcul'!$B:$G,COLUMN(),0),$A:$O,2,0)","v":{"$error":"#N/A"}},{"$f":"VLOOKUP(VLOOKUP($A$62,'Pairing List calcul'!$B:$G,COLUMN(),0),$A:$O,2,0)","v":{"$error":"#N/A"}},{"$f":"VLOOKUP(VLOOKUP($A$62,'Pairing List calcul'!$B:$G,COLUMN(),0),$A:$O,2,0)","v":{"$error":"#N/A"}},{"$f":"VLOOKUP(VLOOKUP($A$62,'Pairing List calcul'!$B:$G,COLUMN(),0),$A:$O,2,0)","v":{"$error":"#N/A"}},{"$f":"VLOOKUP(VLOOKUP($A$62,'Pairing List calcul'!$B:$G,COLUMN(),0),$A:$O,2,0)","v":{"$error":"#N/A"}}]
["Place"]
["Flight 5"]
["Race",{"$f":"B33","v":"Boat 1"},"Boat 2","Boat 3","Boat 4","Boat 5"]
[9,{"$f":"VLOOKUP(VLOOKUP($A$66,'Pairing List calcul'!$B:$G,COLUMN(),0),$A:$O,2,0)","v":"Equipage 2"},{"$f":"VLOOKUP(VLOOKUP($A$66,'Pairing List calcul'!$B:$G,COLUMN(),0),$A:$O,2,0)","v":"Equipage 3"},{"$f":"VLOOKUP(VLOOKUP($A$66,'Pairing List calcul'!$B:$G,COLUMN(),0),$A:$O,2,0)","v":"Equipage 6"},{"$f":"VLOOKUP(VLOOKUP($A$66,'Pairing List calcul'!$B:$G,COLUMN(),0),$A:$O,2,0)","v":"Equipage 9"},{"$f":"VLOOKUP(VLOOKUP($A$66,'Pairing List calcul'!$B:$G,COLUMN(),0),$A:$O,2,0)","v":"Equipage 7"}]
["Place"]
[10,{"$f":"VLOOKUP(VLOOKUP($A$68,'Pairing List calcul'!$B:$G,COLUMN(),0),$A:$O,2,0)","v":"Equipage 4"},{"$f":"VLOOKUP(VLOOKUP($A$68,'Pairing List calcul'!$B:$G,COLUMN(),0),$A:$O,2,0)","v":"Equipage 10"},{"$f":"VLOOKUP(VLOOKUP($A$68,'Pairing List calcul'!$B:$G,COLUMN(),0),$A:$O,2,0)","v":"Equipage 8"},{"$f":"VLOOKUP(VLOOKUP($A$68,'Pairing List calcul'!$B:$G,COLUMN(),0),$A:$O,2,0)","v":"Equipage 5"},{"$f":"VLOOKUP(VLOOKUP($A$68,'Pairing List calcul'!$B:$G,COLUMN(),0),$A:$O,2,0)","v":"Equipage 1"}]
["Place"]
[null,{"$f":"VLOOKUP(VLOOKUP($A$70,'Pairing List calcul'!$B:$G,COLUMN(),0),$A:$O,2,0)","v":{"$error":"#N/A"}},{"$f":"VLOOKUP(VLOOKUP($A$70,'Pairing List calcul'!$B:$G,COLUMN(),0),$A:$O,2,0)","v":{"$error":"#N/A"}},{"$f":"VLOOKUP(VLOOKUP($A$70,'Pairing List calcul'!$B:$G,COLUMN(),0),$A:$O,2,0)","v":{"$error":"#N/A"}},{"$f":"VLOOKUP(VLOOKUP($A$70,'Pairing List calcul'!$B:$G,COLUMN(),0),$A:$O,2,0)","v":{"$error":"#N/A"}},{"$f":"VLOOKUP(VLOOKUP($A$70,'Pairing List calcul'!$B:$G,COLUMN(),0),$A:$O,2,0)","v":{"$error":"#N/A"}}]
["Place"]
["Flight 6"]
["Race",{"$f":"B33","v":"Boat 1"},"Boat 2","Boat 3","Boat 4","Boat 5"]
[11,{"$f":"VLOOKUP(VLOOKUP($A$74,'Pairing List calcul'!$B:$G,COLUMN(),0),$A:$O,2,0)","v":"Equipage 3"},{"$f":"VLOOKUP(VLOOKUP($A$74,'Pairing List calcul'!$B:$G,COLUMN(),0),$A:$O,2,0)","v":"Equipage 7"},{"$f":"VLOOKUP(VLOOKUP($A$74,'Pairing List calcul'!$B:$G,COLUMN(),0),$A:$O,2,0)","v":"Equipage 2"},{"$f":"VLOOKUP(VLOOKUP($A$74,'Pairing List calcul'!$B:$G,COLUMN(),0),$A:$O,2,0)","v":"Equipage 6"},{"$f":"VLOOKUP(VLOOKUP($A$74,'Pairing List calcul'!$B:$G,COLUMN(),0),$A:$O,2,0)","v":"Equipage 1"}]
["Place"]
[12,{"$f":"VLOOKUP(VLOOKUP($A$76,'Pairing List calcul'!$B:$G,COLUMN(),0),$A:$O,2,0)","v":"Equipage 4"},{"$f":"VLOOKUP(VLOOKUP($A$76,'Pairing List calcul'!$B:$G,COLUMN(),0),$A:$O,2,0)","v":"Equipage 8"},{"$f":"VLOOKUP(VLOOKUP($A$76,'Pairing List calcul'!$B:$G,COLUMN(),0),$A:$O,2,0)","v":"Equipage 9"},{"$f":"VLOOKUP(VLOOKUP($A$76,'Pairing List calcul'!$B:$G,COLUMN(),0),$A:$O,2,0)","v":"Equipage 10"},{"$f":"VLOOKUP(VLOOKUP($A$76,'Pairing List calcul'!$B:$G,COLUMN(),0),$A:$O,2,0)","v":"Equipage 5"}]
["Place"]
[null,{"$f":"VLOOKUP(VLOOKUP($A$78,'Pairing List calcul'!$B:$G,COLUMN(),0),$A:$O,2,0)","v":{"$error":"#N/A"}},{"$f":"VLOOKUP(VLOOKUP($A$78,'Pairing List calcul'!$B:$G,COLUMN(),0),$A:$O,2,0)","v":{"$error":"#N/A"}},{"$f":"VLOOKUP(VLOOKUP($A$78,'Pairing List calcul'!$B:$G,COLUMN(),0),$A:$O,2,0)","v":{"$error":"#N/A"}},{"$f":"VLOOKUP(VLOOKUP($A$78,'Pairing List calcul'!$B:$G,COLUMN(),0),$A:$O,2,0)","v":{"$error":"#N/A"}},{"$f":"VLOOKUP(VLOOKUP($A$78,'Pairing List calcul'!$B:$G,COLUMN(),0),$A:$O,2,0)","v":{"$error":"#N/A"}}]
["Place"]
["Flight 7"]
["Race",{"$f":"B33","v":"Boat 1"},"Boat 2","Boat 3","Boat 4","Boat 5"]
[13,{"$f":"VLOOKUP(VLOOKUP($A$82,'Pairing List calcul'!$B:$G,COLUMN(),0),$A:$O,2,0)","v":"Equipage 4"},{"$f":"VLOOKUP(VLOOKUP($A$82,'Pairing List calcul'!$B:$G,COLUMN(),0),$A:$O,2,0)","v":"Equipage 8"},{"$f":"VLOOKUP(VLOOKUP($A$82,'Pairing List calcul'!$B:$G,COLUMN(),0),$A:$O,2,0)","v":"Equipage 7"},{"$f":"VLOOKUP(VLOOKUP($A$82,'Pairing List calcul'!$B:$G,COLUMN(),0),$A:$O,2,0)","v":"Equipage 10"},{"$f":"VLOOKUP(VLOOKUP($A$82,'Pairing List calcul'!$B:$G,COLUMN(),0),$A:$O,2,0)","v":"Equipage 5"}]
["Place"]
[14,{"$f":"VLOOKUP(VLOOKUP($A$84,'Pairing List calcul'!$B:$G,COLUMN(),0),$A:$O,2,0)","v":"Equipage 6"},{"$f":"VLOOKUP(VLOOKUP($A$84,'Pairing List calcul'!$B:$G,COLUMN(),0),$A:$O,2,0)","v":"Equipage 9"},{"$f":"VLOOKUP(VLOOKUP($A$84,'Pairing List calcul'!$B:$G,COLUMN(),0),$A:$O,2,0)","v":"Equipage 1"},{"$f":"VLOOKUP(VLOOKUP($A$84,'Pairing List calcul'!$B:$G,COLUMN(),0),$A:$O,2,0)","v":"Equipage 3"},{"$f":"VLOOKUP(VLOOKUP($A$84,'Pairing List calcul'!$B:$G,COLUMN(),0),$A:$O,2,0)","v":"Equipage 2"}]
["Place"]
[null,{"$f":"VLOOKUP(VLOOKUP($A$86,'Pairing List calcul'!$B:$G,COLUMN(),0),$A:$O,2,0)","v":{"$error":"#N/A"}},{"$f":"VLOOKUP(VLOOKUP($A$86,'Pairing List calcul'!$B:$G,COLUMN(),0),$A:$O,2,0)","v":{"$error":"#N/A"}},{"$f":"VLOOKUP(VLOOKUP($A$86,'Pairing List calcul'!$B:$G,COLUMN(),0),$A:$O,2,0)","v":{"$error":"#N/A"}},{"$f":"VLOOKUP(VLOOKUP($A$86,'Pairing List calcul'!$B:$G,COLUMN(),0),$A:$O,2,0)","v":{"$error":"#N/A"}},{"$f":"VLOOKUP(VLOOKUP($A$86,'Pairing List calcul'!$B:$G,COLUMN(),0),$A:$O,2,0)","v":{"$error":"#N/A"}}]
["Place"]
["Flight 8"]
["Race",{"$f":"B33","v":"Boat 1"},"Boat 2","Boat 3","Boat 4","Boat 5"]
[15,{"$f":"VLOOKUP(VLOOKUP($A$90,'Pairing List calcul'!$B:$G,COLUMN(),0),$A:$O,2,0)","v":"Equipage 6"},{"$f":"VLOOKUP(VLOOKUP($A$90,'Pairing List calcul'!$B:$G,COLUMN(),0),$A:$O,2,0)","v":"Equipage 9"},{"$f":"VLOOKUP(VLOOKUP($A$90,'Pairing List calcul'!$B:$G,COLUMN(),0),$A:$O,2,0)","v":"Equipage 5"},{"$f":"VLOOKUP(VLOOKUP($A$90,'Pairing List calcul'!$B:$G,COLUMN(),0),$A:$O,2,0)","v":"Equipage 4"},{"$f":"VLOOKUP(VLOOKUP($A$90,'Pairing List calcul'!$B:$G,COLUMN(),0),$A:$O,2,0)","v":"Equipage 7"}]
["Place"]
[16,{"$f":"VLOOKUP(VLOOKUP($A$92,'Pairing List calcul'!$B:$G,COLUMN(),0),$A:$O,2,0)","v":"Equipage 10"},{"$f":"VLOOKUP(VLOOKUP($A$92,'Pairing List calcul'!$B:$G,COLUMN(),0),$A:$O,2,0)","v":"Equipage 1"},{"$f":"VLOOKUP(VLOOKUP($A$92,'Pairing List calcul'!$B:$G,COLUMN(),0),$A:$O,2,0)","v":"Equipage 3"},{"$f":"VLOOKUP(VLOOKUP($A$92,'Pairing List calcul'!$B:$G,COLUMN(),0),$A:$O,2,0)","v":"Equipage 2"},{"$f":"VLOOKUP(VLOOKUP($A$92,'Pairing List calcul'!$B:$G,COLUMN(),0),$A:$O,2,0)","v":"Equipage 8"}]
["Place"]
[null,{"$f":"VLOOKUP(VLOOKUP($A$94,'Pairing List calcul'!$B:$G,COLUMN(),0),$A:$O,2,0)","v":{"$error":"#N/A"}},{"$f":"VLOOKUP(VLOOKUP($A$94,'Pairing List calcul'!$B:$G,COLUMN(),0),$A:$O,2,0)","v":{"$error":"#N/A"}},{"$f":"VLOOKUP(VLOOKUP($A$94,'Pairing List calcul'!$B:$G,COLUMN(),0),$A:$O,2,0)","v":{"$error":"#N/A"}},{"$f":"VLOOKUP(VLOOKUP($A$94,'Pairing List calcul'!$B:$G,COLUMN(),0),$A:$O,2,0)","v":{"$error":"#N/A"}},{"$f":"VLOOKUP(VLOOKUP($A$94,'Pairing List calcul'!$B:$G,COLUMN(),0),$A:$O,2,0)","v":{"$error":"#N/A"}}]
["Place"]
["Flight 9"]
["Race",{"$f":"B33","v":"Boat 1"},"Boat 2","Boat 3","Boat 4","Boat 5"]
[17,{"$f":"VLOOKUP(VLOOKUP($A$98,'Pairing List calcul'!$B:$G,COLUMN(),0),$A:$O,2,0)","v":"Equipage 6"},{"$f":"VLOOKUP(VLOOKUP($A$98,'Pairing List calcul'!$B:$G,COLUMN(),0),$A:$O,2,0)","v":"Equipage 1"},{"$f":"VLOOKUP(VLOOKUP($A$98,'Pairing List calcul'!$B:$G,COLUMN(),0),$A:$O,2,0)","v":"Equipage 9"},{"$f":"VLOOKUP(VLOOKUP($A$98,'Pairing List calcul'!$B:$G,COLUMN(),0),$A:$O,2,0)","v":"Equipage 2"},{"$f":"VLOOKUP(VLOOKUP($A$98,'Pairing List calcul'!$B:$G,COLUMN(),0),$A:$O,2,0)","v":"Equipage 4"}]
["Place"]
[18,{"$f":"VLOOKUP(VLOOKUP($A$100,'Pairing List calcul'!$B:$G,COLUMN(),0),$A:$O,2,0)","v":"Equipage 3"},{"$f":"VLOOKUP(VLOOKUP($A$100,'Pairing List calcul'!$B:$G,COLUMN(),0),$A:$O,2,0)","v":"Equipage 8"},{"$f":"VLOOKUP(VLOOKUP($A$100,'Pairing List calcul'!$B:$G,COLUMN(),0),$A:$O,2,0)","v":"Equipage 5"},{"$f":"VLOOKUP(VLOOKUP($A$100,'Pairing List calcul'!$B:$G,COLUMN(),0),$A:$O,2,0)","v":"Equipage 7"},{"$f":"VLOOKUP(VLOOKUP($A$100,'Pairing List calcul'!$B:$G,COLUMN(),0),$A:$O,2,0)","v":"Equipage 10"}]
["Place"]
[null,{"$f":"VLOOKUP(VLOOKUP($A$102,'Pairing List calcul'!$B:$G,COLUMN(),0),$A:$O,2,0)","v":{"$error":"#N/A"}},{"$f":"VLOOKUP(VLOOKUP($A$102,'Pairing List calcul'!$B:$G,COLUMN(),0),$A:$O,2,0)","v":{"$error":"#N/A"}},{"$f":"VLOOKUP(VLOOKUP($A$102,'Pairing List calcul'!$B:$G,COLUMN(),0),$A:$O,2,0)","v":{"$error":"#N/A"}},{"$f":"VLOOKUP(VLOOKUP($A$102,'Pairing List calcul'!$B:$G,COLUMN(),0),$A:$O,2,0)","v":{"$error":"#N/A"}},{"$f":"VLOOKUP(VLOOKUP($A$102,'Pairing List calcul'!$B:$G,COLUMN(),0),$A:$O,2,0)","v":{"$error":"#N/A"}}]
["Place"]
["Flight 10"]
["Race",{"$f":"B33","v":"Boat 1"},"Boat 2","Boat 3","Boat 4","Boat 5"]
[19,{"$f":"VLOOKUP(VLOOKUP($A$106,'Pairing List calcul'!$B:$G,COLUMN(),0),$A:$O,2,0)","v":"Equipage 3"},{"$f":"VLOOKUP(VLOOKUP($A$106,'Pairing List calcul'!$B:$G,COLUMN(),0),$A:$O,2,0)","v":"Equipage 6"},{"$f":"VLOOKUP(VLOOKUP($A$106,'Pairing List calcul'!$B:$G,COLUMN(),0),$A:$O,2,0)","v":"Equipage 5"},{"$f":"VLOOKUP(VLOOKUP($A$106,'Pairing List calcul'!$B:$G,COLUMN(),0),$A:$O,2,0)","v":"Equipage 7"},{"$f":"VLOOKUP(VLOOKUP($A$106,'Pairing List calcul'!$B:$G,COLUMN(),0),$A:$O,2,0)","v":"Equipage 2"}]
["Place"]
[20,{"$f":"VLOOKUP(VLOOKUP($A$108,'Pairing List calcul'!$B:$G,COLUMN(),0),$A:$O,2,0)","v":"Equipage 10"},{"$f":"VLOOKUP(VLOOKUP($A$108,'Pairing List calcul'!$B:$G,COLUMN(),0),$A:$O,2,0)","v":"Equipage 4"},{"$f":"VLOOKUP(VLOOKUP($A$108,'Pairing List calcul'!$B:$G,COLUMN(),0),$A:$O,2,0)","v":"Equipage 1"},{"$f":"VLOOKUP(VLOOKUP($A$108,'Pairing List calcul'!$B:$G,COLUMN(),0),$A:$O,2,0)","v":"Equipage 8"},{"$f":"VLOOKUP(VLOOKUP($A$108,'Pairing List calcul'!$B:$G,COLUMN(),0),$A:$O,2,0)","v":"Equipage 9"}]
["Place"]
[null,{"$f":"VLOOKUP(VLOOKUP($A$110,'Pairing List calcul'!$B:$G,COLUMN(),0),$A:$O,2,0)","v":{"$error":"#N/A"}},{"$f":"VLOOKUP(VLOOKUP($A$110,'Pairing List calcul'!$B:$G,COLUMN(),0),$A:$O,2,0)","v":{"$error":"#N/A"}},{"$f":"VLOOKUP(VLOOKUP($A$110,'Pairing List calcul'!$B:$G,COLUMN(),0),$A:$O,2,0)","v":{"$error":"#N/A"}},{"$f":"VLOOKUP(VLOOKUP($A$110,'Pairing List calcul'!$B:$G,COLUMN(),0),$A:$O,2,0)","v":{"$error":"#N/A"}},{"$f":"VLOOKUP(VLOOKUP($A$110,'Pairing List calcul'!$B:$G,COLUMN(),0),$A:$O,2,0)","v":{"$error":"#N/A"}}]
["Place"]
["Flight 11"]
["Race",{"$f":"B33","v":"Boat 1"},"Boat 2","Boat 3","Boat 4","Boat 5"]
[21,{"$f":"VLOOKUP(VLOOKUP($A$114,'Pairing List calcul'!$B:$G,COLUMN(),0),$A:$O,2,0)","v":"Equipage 5"},{"$f":"VLOOKUP(VLOOKUP($A$114,'Pairing List calcul'!$B:$G,COLUMN(),0),$A:$O,2,0)","v":"Equipage 2"},{"$f":"VLOOKUP(VLOOKUP($A$114,'Pairing List calcul'!$B:$G,COLUMN(),0),$A:$O,2,0)","v":"Equipage 6"},{"$f":"VLOOKUP(VLOOKUP($A$114,'Pairing List calcul'!$B:$G,COLUMN(),0),$A:$O,2,0)","v":"Equipage 8"},{"$f":"VLOOKUP(VLOOKUP($A$114,'Pairing List calcul'!$B:$G,COLUMN(),0),$A:$O,2,0)","v":"Equipage 9"}]
["Place"]
[22,{"$f":"VLOOKUP(VLOOKUP($A$116,'Pairing List calcul'!$B:$G,COLUMN(),0),$A:$O,2,0)","v":"Equipage 1"},{"$f":"VLOOKUP(VLOOKUP($A$116,'Pairing List calcul'!$B:$G,COLUMN(),0),$A:$O,2,0)","v":"Equipage 7"},{"$f":"VLOOKUP(VLOOKUP($A$116,'Pairing List calcul'!$B:$G,COLUMN(),0),$A:$O,2,0)","v":"Equipage 10"},{"$f":"VLOOKUP(VLOOKUP($A$116,'Pairing List calcul'!$B:$G,COLUMN(),0),$A:$O,2,0)","v":"Equipage 4"},{"$f":"VLOOKUP(VLOOKUP($A$116,'Pairing List calcul'!$B:$G,COLUMN(),0),$A:$O,2,0)","v":"Equipage 3"}]
["Place"]
[null,{"$f":"VLOOKUP(VLOOKUP($A$118,'Pairing List calcul'!$B:$G,COLUMN(),0),$A:$O,2,0)","v":{"$error":"#N/A"}},{"$f":"VLOOKUP(VLOOKUP($A$118,'Pairing List calcul'!$B:$G,COLUMN(),0),$A:$O,2,0)","v":{"$error":"#N/A"}},{"$f":"VLOOKUP(VLOOKUP($A$118,'Pairing List calcul'!$B:$G,COLUMN(),0),$A:$O,2,0)","v":{"$error":"#N/A"}},{"$f":"VLOOKUP(VLOOKUP($A$118,'Pairing List calcul'!$B:$G,COLUMN(),0),$A:$O,2,0)","v":{"$error":"#N/A"}},{"$f":"VLOOKUP(VLOOKUP($A$118,'Pairing List calcul'!$B:$G,COLUMN(),0),$A:$O,2,0)","v":{"$error":"#N/A"}}]
["Place"]
["Flight 12"]
["Race",{"$f":"B33","v":"Boat 1"},"Boat 2","Boat 3","Boat 4","Boat 5"]
[23,{"$f":"VLOOKUP(VLOOKUP($A$122,'Pairing List calcul'!$B:$G,COLUMN(),0),$A:$O,2,0)","v":"Equipage 9"},{"$f":"VLOOKUP(VLOOKUP($A$122,'Pairing List calcul'!$B:$G,COLUMN(),0),$A:$O,2,0)","v":"Equipage 6"},{"$f":"VLOOKUP(VLOOKUP($A$122,'Pairing List calcul'!$B:$G,COLUMN(),0),$A:$O,2,0)","v":"Equipage 10"},{"$f":"VLOOKUP(VLOOKUP($A$122,'Pairing List calcul'!$B:$G,COLUMN(),0),$A:$O,2,0)","v":"Equipage 2"},{"$f":"VLOOKUP(VLOOKUP($A$122,'Pairing List calcul'!$B:$G,COLUMN(),0),$A:$O,2,0)","v":"Equipage 3"}]
["Place"]
[24,{"$f":"VLOOKUP(VLOOKUP($A$124,'Pairing List calcul'!$B:$G,COLUMN(),0),$A:$O,2,0)","v":"Equipage 8"},{"$f":"VLOOKUP(VLOOKUP($A$124,'Pairing List calcul'!$B:$G,COLUMN(),0),$A:$O,2,0)","v":"Equipage 5"},{"$f":"VLOOKUP(VLOOKUP($A$124,'Pairing List calcul'!$B:$G,COLUMN(),0),$A:$O,2,0)","v":"Equipage 7"},{"$f":"VLOOKUP(VLOOKUP($A$124,'Pairing List calcul'!$B:$G,COLUMN(),0),$A:$O,2,0)","v":"Equipage 1"},{"$f":"VLOOKUP(VLOOKUP($A$124,'Pairing List calcul'!$B:$G,COLUMN(),0),$A:$O,2,0)","v":"Equipage 4"}]
["Place"]
[null,{"$f":"VLOOKUP(VLOOKUP($A$126,'Pairing List calcul'!$B:$G,COLUMN(),0),$A:$O,2,0)","v":{"$error":"#N/A"}},{"$f":"VLOOKUP(VLOOKUP($A$126,'Pairing List calcul'!$B:$G,COLUMN(),0),$A:$O,2,0)","v":{"$error":"#N/A"}},{"$f":"VLOOKUP(VLOOKUP($A$126,'Pairing List calcul'!$B:$G,COLUMN(),0),$A:$O,2,0)","v":{"$error":"#N/A"}},{"$f":"VLOOKUP(VLOOKUP($A$126,'Pairing List calcul'!$B:$G,COLUMN(),0),$A:$O,2,0)","v":{"$error":"#N/A"}},{"$f":"VLOOKUP(VLOOKUP($A$126,'Pairing List calcul'!$B:$G,COLUMN(),0),$A:$O,2,0)","v":{"$error":"#N/A"}}]
["Place"]
["Flight 13"]
["Race",{"$f":"B33","v":"Boat 1"},"Boat 2","Boat 3","Boat 4","Boat 5"]
[25,{"$f":"VLOOKUP(VLOOKUP($A$130,'Pairing List calcul'!$B:$G,COLUMN(),0),$A:$O,2,0)","v":"Equipage 8"},{"$f":"VLOOKUP(VLOOKUP($A$130,'Pairing List calcul'!$B:$G,COLUMN(),0),$A:$O,2,0)","v":"Equipage 3"},{"$f":"VLOOKUP(VLOOKUP($A$130,'Pairing List calcul'!$B:$G,COLUMN(),0),$A:$O,2,0)","v":"Equipage 2"},{"$f":"VLOOKUP(VLOOKUP($A$130,'Pairing List calcul'!$B:$G,COLUMN(),0),$A:$O,2,0)","v":"Equipage 1"},{"$f":"VLOOKUP(VLOOKUP($A$130,'Pairing List calcul'!$B:$G,COLUMN(),0),$A:$O,2,0)","v":"Equipage 9"}]
["Place"]
[26,{"$f":"VLOOKUP(VLOOKUP($A$132,'Pairing List calcul'!$B:$G,COLUMN(),0),$A:$O,2,0)","v":"Equipage 4"},{"$f":"VLOOKUP(VLOOKUP($A$132,'Pairing List calcul'!$B:$G,COLUMN(),0),$A:$O,2,0)","v":"Equipage 7"},{"$f":"VLOOKUP(VLOOKUP($A$132,'Pairing List calcul'!$B:$G,COLUMN(),0),$A:$O,2,0)","v":"Equipage 6"},{"$f":"VLOOKUP(VLOOKUP($A$132,'Pairing List calcul'!$B:$G,COLUMN(),0),$A:$O,2,0)","v":"Equipage 5"},{"$f":"VLOOKUP(VLOOKUP($A$132,'Pairing List calcul'!$B:$G,COLUMN(),0),$A:$O,2,0)","v":"Equipage 10"}]
["Place"]
[]
["Place"]
["Flight 14"]
["Race",{"$f":"B33","v":"Boat 1"},"Boat 2","Boat 3","Boat 4","Boat 5"]
[27,{"$f":"VLOOKUP(VLOOKUP($A$138,'Pairing List calcul'!$B:$G,COLUMN(),0),$A:$O,2,0)","v":"Equipage 9"},{"$f":"VLOOKUP(VLOOKUP($A$138,'Pairing List calcul'!$B:$G,COLUMN(),0),$A:$O,2,0)","v":"Equipage 2"},{"$f":"VLOOKUP(VLOOKUP($A$138,'Pairing List calcul'!$B:$G,COLUMN(),0),$A:$O,2,0)","v":"Equipage 6"},{"$f":"VLOOKUP(VLOOKUP($A$138,'Pairing List calcul'!$B:$G,COLUMN(),0),$A:$O,2,0)","v":"Equipage 5"},{"$f":"VLOOKUP(VLOOKUP($A$138,'Pairing List calcul'!$B:$G,COLUMN(),0),$A:$O,2,0)","v":"Equipage 8"}]
["Place"]
[28,{"$f":"VLOOKUP(VLOOKUP($A$140,'Pairing List calcul'!$B:$G,COLUMN(),0),$A:$O,2,0)","v":"Equipage 7"},{"$f":"VLOOKUP(VLOOKUP($A$140,'Pairing List calcul'!$B:$G,COLUMN(),0),$A:$O,2,0)","v":"Equipage 1"},{"$f":"VLOOKUP(VLOOKUP($A$140,'Pairing List calcul'!$B:$G,COLUMN(),0),$A:$O,2,0)","v":"Equipage 10"},{"$f":"VLOOKUP(VLOOKUP($A$140,'Pairing List calcul'!$B:$G,COLUMN(),0),$A:$O,2,0)","v":"Equipage 4"},{"$f":"VLOOKUP(VLOOKUP($A$140,'Pairing List calcul'!$B:$G,COLUMN(),0),$A:$O,2,0)","v":"Equipage 3"}]
["Place"]
[null,{"$f":"VLOOKUP(VLOOKUP($A$142,'Pairing List calcul'!$B:$G,COLUMN(),0),$A:$O,2,0)","v":{"$error":"#N/A"}},{"$f":"VLOOKUP(VLOOKUP($A$142,'Pairing List calcul'!$B:$G,COLUMN(),0),$A:$O,2,0)","v":{"$error":"#N/A"}},{"$f":"VLOOKUP(VLOOKUP($A$142,'Pairing List calcul'!$B:$G,COLUMN(),0),$A:$O,2,0)","v":{"$error":"#N/A"}},{"$f":"VLOOKUP(VLOOKUP($A$142,'Pairing List calcul'!$B:$G,COLUMN(),0),$A:$O,2,0)","v":{"$error":"#N/A"}},{"$f":"VLOOKUP(VLOOKUP($A$142,'Pairing List calcul'!$B:$G,COLUMN(),0),$A:$O,2,0)","v":{"$error":"#N/A"}}]
["Place"]
["Flight 15"]
["Race",{"$f":"B33","v":"Boat 1"},"Boat 2","Boat 3","Boat 4","Boat 5"]
[29,{"$f":"VLOOKUP(VLOOKUP($A$146,'Pairing List calcul'!$B:$G,COLUMN(),0),$A:$O,2,0)","v":"Equipage 8"},{"$f":"VLOOKUP(VLOOKUP($A$146,'Pairing List calcul'!$B:$G,COLUMN(),0),$A:$O,2,0)","v":"Equipage 1"},{"$f":"VLOOKUP(VLOOKUP($A$146,'Pairing List calcul'!$B:$G,COLUMN(),0),$A:$O,2,0)","v":"Equipage 2"},{"$f":"VLOOKUP(VLOOKUP($A$146,'Pairing List calcul'!$B:$G,COLUMN(),0),$A:$O,2,0)","v":"Equipage 4"},{"$f":"VLOOKUP(VLOOKUP($A$146,'Pairing List calcul'!$B:$G,COLUMN(),0),$A:$O,2,0)","v":"Equipage 5"}]
["Place"]
[30,{"$f":"VLOOKUP(VLOOKUP($A$148,'Pairing List calcul'!$B:$G,COLUMN(),0),$A:$O,2,0)","v":"Equipage 9"},{"$f":"VLOOKUP(VLOOKUP($A$148,'Pairing List calcul'!$B:$G,COLUMN(),0),$A:$O,2,0)","v":"Equipage 7"},{"$f":"VLOOKUP(VLOOKUP($A$148,'Pairing List calcul'!$B:$G,COLUMN(),0),$A:$O,2,0)","v":"Equipage 10"},{"$f":"VLOOKUP(VLOOKUP($A$148,'Pairing List calcul'!$B:$G,COLUMN(),0),$A:$O,2,0)","v":"Equipage 6"},{"$f":"VLOOKUP(VLOOKUP($A$148,'Pairing List calcul'!$B:$G,COLUMN(),0),$A:$O,2,0)","v":"Equipage 3"}]
["Place"]
[null,{"$f":"VLOOKUP(VLOOKUP($A$150,'Pairing List calcul'!$B:$G,COLUMN(),0),$A:$O,2,0)","v":{"$error":"#N/A"}},{"$f":"VLOOKUP(VLOOKUP($A$150,'Pairing List calcul'!$B:$G,COLUMN(),0),$A:$O,2,0)","v":{"$error":"#N/A"}},{"$f":"VLOOKUP(VLOOKUP($A$150,'Pairing List calcul'!$B:$G,COLUMN(),0),$A:$O,2,0)","v":{"$error":"#N/A"}},{"$f":"VLOOKUP(VLOOKUP($A$150,'Pairing List calcul'!$B:$G,COLUMN(),0),$A:$O,2,0)","v":{"$error":"#N/A"}},{"$f":"VLOOKUP(VLOOKUP($A$150,'Pairing List calcul'!$B:$G,COLUMN(),0),$A:$O,2,0)","v":{"$error":"#N/A"}}]
["Place"]
["Flight 16"]
["Race",{"$f":"B33","v":"Boat 1"},"Boat 2","Boat 3","Boat 4","Boat 5"]
[31,{"$f":"VLOOKUP(VLOOKUP($A$154,'Pairing List calcul'!$B:$G,COLUMN(),0),$A:$O,2,0)","v":"Equipage 1"},{"$f":"VLOOKUP(VLOOKUP($A$154,'Pairing List calcul'!$B:$G,COLUMN(),0),$A:$O,2,0)","v":"Equipage 7"},{"$f":"VLOOKUP(VLOOKUP($A$154,'Pairing List calcul'!$B:$G,COLUMN(),0),$A:$O,2,0)","v":"Equipage 10"},{"$f":"VLOOKUP(VLOOKUP($A$154,'Pairing List calcul'!$B:$G,COLUMN(),0),$A:$O,2,0)","v":"Equipage 6"},{"$f":"VLOOKUP(VLOOKUP($A$154,'Pairing List calcul'!$B:$G,COLUMN(),0),$A:$O,2,0)","v":"Equipage 4"}]
["Place"]
[32,{"$f":"VLOOKUP(VLOOKUP($A$156,'Pairing List calcul'!$B:$G,COLUMN(),0),$A:$O,2,0)","v":"Equipage 3"},{"$f":"VLOOKUP(VLOOKUP($A$156,'Pairing List calcul'!$B:$G,COLUMN(),0),$A:$O,2,0)","v":"Equipage 9"},{"$f":"VLOOKUP(VLOOKUP($A$156,'Pairing List calcul'!$B:$G,COLUMN(),0),$A:$O,2,0)","v":"Equipage 2"},{"$f":"VLOOKUP(VLOOKUP($A$156,'Pairing List calcul'!$B:$G,COLUMN(),0),$A:$O,2,0)","v":"Equipage 5"},{"$f":"VLOOKUP(VLOOKUP($A$156,'Pairing List calcul'!$B:$G,COLUMN(),0),$A:$O,2,0)","v":"Equipage 8"}]
["Place"]
["Flight 17"]
["Race",{"$f":"B33","v":"Boat 1"},"Boat 2","Boat 3","Boat 4","Boat 5"]
[33,{"$f":"VLOOKUP(VLOOKUP($A$154,'Pairing List calcul'!$B:$G,COLUMN(),0),$A:$O,2,0)","v":"Equipage 1"},{"$f":"VLOOKUP(VLOOKUP($A$154,'Pairing List calcul'!$B:$G,COLUMN(),0),$A:$O,2,0)","v":"Equipage 7"},{"$f":"VLOOKUP(VLOOKUP($A$154,'Pairing List calcul'!$B:$G,COLUMN(),0),$A:$O,2,0)","v":"Equipage 10"},{"$f":"VLOOKUP(VLOOKUP($A$154,'Pairing List calcul'!$B:$G,COLUMN(),0),$A:$O,2,0)","v":"Equipage 6"},{"$f":"VLOOKUP(VLOOKUP($A$154,'Pairing List calcul'!$B:$G,COLUMN(),0),$A:$O,2,0)","v":"Equipage 4"}]
["Place"]
[34,{"$f":"VLOOKUP(VLOOKUP($A$156,'Pairing List calcul'!$B:$G,COLUMN(),0),$A:$O,2,0)","v":"Equipage 3"},{"$f":"VLOOKUP(VLOOKUP($A$156,'Pairing List calcul'!$B:$G,COLUMN(),0),$A:$O,2,0)","v":"Equipage 9"},{"$f":"VLOOKUP(VLOOKUP($A$156,'Pairing List calcul'!$B:$G,COLUMN(),0),$A:$O,2,0)","v":"Equipage 2"},{"$f":"VLOOKUP(VLOOKUP($A$156,'Pairing List calcul'!$B:$G,COLUMN(),0),$A:$O,2,0)","v":"Equipage 5"},{"$f":"VLOOKUP(VLOOKUP($A$156,'Pairing List calcul'!$B:$G,COLUMN(),0),$A:$O,2,0)","v":"Equipage 8"}]
["Place"]
["Flight 18"]
["Race",{"$f":"B33","v":"Boat 1"},"Boat 2","Boat 3","Boat 4","Boat 5"]
[35,{"$f":"VLOOKUP(VLOOKUP($A$154,'Pairing List calcul'!$B:$G,COLUMN(),0),$A:$O,2,0)","v":"Equipage 1"},{"$f":"VLOOKUP(VLOOKUP($A$154,'Pairing List calcul'!$B:$G,COLUMN(),0),$A:$O,2,0)","v":"Equipage 7"},{"$f":"VLOOKUP(VLOOKUP($A$154,'Pairing List calcul'!$B:$G,COLUMN(),0),$A:$O,2,0)","v":"Equipage 10"},{"$f":"VLOOKUP(VLOOKUP($A$154,'Pairing List calcul'!$B:$G,COLUMN(),0),$A:$O,2,0)","v":"Equipage 6"},{"$f":"VLOOKUP(VLOOKUP($A$154,'Pairing List calcul'!$B:$G,COLUMN(),0),$A:$O,2,0)","v":"Equipage 4"}]
["Place"]
[36,{"$f":"VLOOKUP(VLOOKUP($A$156,'Pairing List calcul'!$B:$G,COLUMN(),0),$A:$O,2,0)","v":"Equipage 3"},{"$f":"VLOOKUP(VLOOKUP($A$156,'Pairing List calcul'!$B:$G,COLUMN(),0),$A:$O,2,0)","v":"Equipage 9"},{"$f":"VLOOKUP(VLOOKUP($A$156,'Pairing List calcul'!$B:$G,COLUMN(),0),$A:$O,2,0)","v":"Equipage 2"},{"$f":"VLOOKUP(VLOOKUP($A$156,'Pairing List calcul'!$B:$G,COLUMN(),0),$A:$O,2,0)","v":"Equipage 5"},{"$f":"VLOOKUP(VLOOKUP($A$156,'Pairing List calcul'!$B:$G,COLUMN(),0),$A:$O,2,0)","v":"Equipage 8"}]
["Place"]

{"sheet":"Général_Officiel","index":4,"n_rows":20,"n_cols":7,"rows_kept":20,"cut":false,"hidden":false,"merged":[[4,2,6,6]]}
[]
[]
[]
[]
[null,null,"Classement général provisoire \n- Nom régate-"]
[]
[]
[]
[null,null,null,null,"Equipage","Points "]
[null,null,null,{"$f":"Général!Q3","v":0},{"$f":"Général!B3","v":"Equipage 1"},{"$f":"Général!P3","v":0}]
[null,null,null,{"$f":"Général!Q4","v":0},{"$f":"Général!B4","v":"Equipage 2"},{"$f":"Général!P4","v":0}]
[null,null,null,{"$f":"Général!Q5","v":0},{"$f":"Général!B5","v":"Equipage 3"},{"$f":"Général!P5","v":0}]
[null,null,null,{"$f":"Général!Q6","v":0},{"$f":"Général!B6","v":"Equipage 4"},{"$f":"Général!P6","v":0}]
[null,null,null,{"$f":"Général!Q7","v":0},{"$f":"Général!B7","v":"Equipage 5"},{"$f":"Général!P7","v":0}]
[null,null,null,{"$f":"Général!Q8","v":0},{"$f":"Général!B8","v":"Equipage 6"},{"$f":"Général!P8","v":0}]
[null,null,null,{"$f":"Général!Q9","v":0},{"$f":"Général!B9","v":"Equipage 7"},{"$f":"Général!P9","v":0}]
[null,null,null,{"$f":"Général!Q10","v":0},{"$f":"Général!B10","v":"Equipage 8"},{"$f":"Général!P10","v":0}]
[null,null,null,{"$f":"Général!Q11","v":0},{"$f":"Général!B11","v":"Equipage 9"},{"$f":"Général!P11","v":0}]
[null,null,null,{"$f":"Général!Q12","v":0},{"$f":"Général!B12","v":"Equipage 10"},{"$f":"Général!P12","v":0}]
[null,null,null,null,null,null,{"$f":"TODAY()","v":"2024-10-09"}]

{"sheet":"Analyse","index":5,"n_rows":18,"n_cols":13,"rows_kept":18,"cut":false,"hidden":true,"merged":[]}
[null,"Bateaux",1,{"$f":"C1+1","v":2},3,4,5,6,7,8,9,10]
[null,1,{"$f":"COUNTIF('Pairing List calcul'!$C$2:$C$29,FIXED(C1,0, ))","v":2},{"$f":"COUNTIF('Pairing List calcul'!$C$2:$C$29,FIXED(D1,0, ))","v":2},{"$f":"COUNTIF('Pairing List calcul'!$C$2:$C$29,FIXED(E1,0, ))","v":3},{"$f":"COUNTIF('Pairing List calcul'!$C$2:$C$29,FIXED(F1,0, ))","v":4},{"$f":"COUNTIF('Pairing List calcul'!$C$2:$C$29,FIXED(G1,0, ))","v":3},{"$f":"COUNTIF('Pairing List calcul'!$C$2:$C$29,FIXED(H1,0, ))","v":3},{"$f":"COUNTIF('Pairing List calcul'!$C$2:$C$29,FIXED(I1,0, ))","v":2},{"$f":"COUNTIF('Pairing List calcul'!$C$2:$C$29,FIXED(J1,0, ))","v":4},{"$f":"COUNTIF('Pairing List calcul'!$C$2:$C$29,FIXED(K1,0, ))","v":2},{"$f":"COUNTIF('Pairing List calcul'!$C$2:$C$29,FIXED(L1,0, ))","v":3}]
[null,{"$f":"B2+1","v":2},{"$f":"COUNTIF('Pairing List calcul'!$D$2:$D$29,FIXED(C1,0, ))","v":3},{"$f":"COUNTIF('Pairing List calcul'!$D$2:$D$29,FIXED(D1,0, ))","v":4},{"$f":"COUNTIF('Pairing List calcul'!$D$2:$D$29,FIXED(E1,0, ))","v":2},{"$f":"COUNTIF('Pairing List calcul'!$D$2:$D$29,FIXED(F1,0, ))","v":3},{"$f":"COUNTIF('Pairing List calcul'!$D$2:$D$29,FIXED(G1,0, ))","v":2},{"$f":"COUNTIF('Pairing List calcul'!$D$2:$D$29,FIXED(H1,0, ))","v":2},{"$f":"COUNTIF('Pairing List calcul'!$D$2:$D$29,FIXED(I1,0, ))","v":4},{"$f":"COUNTIF('Pairing List calcul'!$D$2:$D$29,FIXED(J1,0, ))","v":4},{"$f":"COUNTIF('Pairing List calcul'!$D$2:$D$29,FIXED(K1,0, ))","v":2},{"$f":"COUNTIF('Pairing List calcul'!$D$2:$D$29,FIXED(L1,0, ))","v":2}]
[null,{"$f":"B3+1","v":3},{"$f":"COUNTIF('Pairing List calcul'!$E$2:$E$29,FIXED(C1,0, ))","v":2},{"$f":"COUNTIF('Pairing List calcul'!$E$2:$E$29,FIXED(D1,0, ))","v":2},{"$f":"COUNTIF('Pairing List calcul'!$E$2:$E$29,FIXED(E1,0, ))","v":4},{"$f":"COUNTIF('Pairing List calcul'!$E$2:$E$29,FIXED(F1,0, ))","v":2},{"$f":"COUNTIF('Pairing List calcul'!$E$2:$E$29,FIXED(G1,0, ))","v":3},{"$f":"COUNTIF('Pairing List calcul'!$E$2:$E$29,FIXED(H1,0, ))","v":4},{"$f":"COUNTIF('Pairing List calcul'!$E$2:$E$29,FIXED(I1,0, ))","v":2},{"$f":"COUNTIF('Pairing List calcul'!$E$2:$E$29,FIXED(J1,0, ))","v":2},{"$f":"COUNTIF('Pairing List calcul'!$E$2:$E$29,FIXED(K1,0, ))","v":4},{"$f":"COUNTIF('Pairing List calcul'!$E$2:$E$29,FIXED(L1,0, ))","v":3}]
[null,{"$f":"B4+1","v":4},{"$f":"COUNTIF('Pairing List calcul'!$F$2:$F$29,FIXED(C1,0, ))","v":3},{"$f":"COUNTIF('Pairing List calcul'!$F$2:$F$29,FIXED(D1,0, ))","v":3},{"$f":"COUNTIF('Pairing List calcul'!$F$2:$F$29,FIXED(E1,0, ))","v":2},{"$f":"COUNTIF('Pairing List calcul'!$F$2:$F$29,FIXED(F1,0, ))","v":3},{"$f":"COUNTIF('Pairing List calcul'!$F$2:$F$29,FIXED(G1,0, ))","v":4},{"$f":"COUNTIF('Pairing List calcul'!$F$2:$F$29,FIXED(H1,0, ))","v":2},{"$f":"COUNTIF('Pairing List calcul'!$F$2:$F$29,FIXED(I1,0, ))","v":2},{"$f":"COUNTIF('Pairing List calcul'!$F$2:$F$29,FIXED(J1,0, ))","v":2},{"$f":"COUNTIF('Pairing List calcul'!$F$2:$F$29,FIXED(K1,0, ))","v":3},{"$f":"COUNTIF('Pairing List calcul'!$F$2:$F$29,FIXED(L1,0, ))","v":4}]
[null,{"$f":"B5+1","v":5},{"$f":"COUNTIF('Pairing List calcul'!$G$2:$G$29,FIXED(C1,0, ))","v":4},{"$f":"COUNTIF('Pairing List calcul'!$G$2:$G$29,FIXED(D1,0, ))","v":3},{"$f":"COUNTIF('Pairing List calcul'!$G$2:$G$29,FIXED(E1,0, ))","v":3},{"$f":"COUNTIF('Pairing List calcul'!$G$2:$G$29,FIXED(F1,0, ))","v":2},{"$f":"COUNTIF('Pairing List calcul'!$G$2:$G$29,FIXED(G1,0, ))","v":2},{"$f":"COUNTIF('Pairing List calcul'!$G$2:$G$29,FIXED(H1,0, ))","v":3},{"$f":"COUNTIF('Pairing List calcul'!$G$2:$G$29,FIXED(I1,0, ))","v":4},{"$f":"COUNTIF('Pairing List calcul'!$G$2:$G$29,FIXED(J1,0, ))","v":2},{"$f":"COUNTIF('Pairing List calcul'!$G$2:$G$29,FIXED(K1,0, ))","v":3},{"$f":"COUNTIF('Pairing List calcul'!$G$2:$G$29,FIXED(L1,0, ))","v":2}]
[]
[null,"Equipe",1,{"$f":"C8+1","v":2},3,4,5,6,7,8,9,10,"Total"]
[null,1,null,{"$f":"Eq.2!W1","v":9},{"$f":"Eq.3!W1","v":8},{"$f":"Eq.4!W1","v":10},{"$f":"Eq.5!W1","v":5},{"$f":"Eq.6!W1","v":6},{"$f":"Eq.7!W1","v":7},{"$f":"Eq.8!W1","v":7},{"$f":"Eq.9!W1","v":5},{"$f":"Eq.10!W1","v":7},{"$f":"SUM(C9:L9)","v":64}]
[null,{"$f":"B9+1","v":2},{"$f":"Eq.1!W2","v":9},null,{"$f":"Eq.3!W2","v":11},{"$f":"Eq.4!W2","v":3},{"$f":"Eq.5!W2","v":8},{"$f":"Eq.6!W2","v":9},{"$f":"Eq.7!W2","v":4},{"$f":"Eq.8!W2","v":8},{"$f":"Eq.9!W2","v":10},{"$f":"Eq.10!W2","v":2},64]
[null,3,{"$f":"Eq.1!W3","v":8},{"$f":"Eq.2!W3","v":11},null,{"$f":"Eq.4!W3","v":2},{"$f":"Eq.5!W3","v":5},{"$f":"Eq.6!W3","v":8},{"$f":"Eq.7!W3","v":9},{"$f":"Eq.8!W3","v":5},{"$f":"Eq.9!W3","v":9},{"$f":"Eq.10!W3","v":7},64]
[null,4,{"$f":"Eq.1!W4","v":10},{"$f":"Eq.2!W4","v":3},{"$f":"Eq.3!W4","v":2},null,{"$f":"Eq.5!W4","v":9},{"$f":"Eq.6!W4","v":6},{"$f":"Eq.7!W4","v":9},{"$f":"Eq.8!W4","v":9},{"$f":"Eq.9!W4","v":5},{"$f":"Eq.10!W4","v":11},64]
[null,5,{"$f":"Eq.1!W5","v":5},{"$f":"Eq.2!W5","v":8},{"$f":"Eq.3!W5","v":5},{"$f":"Eq.4!W5","v":9},null,{"$f":"Eq.6!W5","v":5},{"$f":"Eq.7!W5","v":8},{"$f":"Eq.8!W5","v":12},{"$f":"Eq.9!W5","v":6},{"$f":"Eq.10!W5","v":6},64]
[null,6,{"$f":"Eq.1!W6","v":6},{"$f":"Eq.2!W6","v":9},{"$f":"Eq.3!W6","v":8},{"$f":"Eq.4!W6","v":6},{"$f":"Eq.5!W6","v":5},null,{"$f":"Eq.7!W6","v":9},{"$f":"Eq.8!W6","v":3},{"$f":"Eq.9!W6","v":11},{"$f":"Eq.10!W6","v":7},64]
[null,7,{"$f":"Eq.1!W7","v":7},{"$f":"Eq.2!W7","v":4},{"$f":"Eq.3!W7","v":9},{"$f":"Eq.4!W7","v":9},{"$f":"Eq.5!W7","v":8},{"$f":"Eq.6!W7","v":9},null,{"$f":"Eq.8!W7","v":4},{"$f":"Eq.9!W7","v":4},{"$f":"Eq.10!W7","v":10},64]
[null,8,{"$f":"Eq.1!W8","v":7},{"$f":"Eq.2!W8","v":8},{"$f":"Eq.3!W8","v":5},{"$f":"Eq.4!W8","v":9},{"$f":"Eq.5!W8","v":12},{"$f":"Eq.6!W8","v":3},{"$f":"Eq.7!W8","v":4},null,{"$f":"Eq.9!W8","v":8},{"$f":"Eq.10!W8","v":8},64]
[null,9,{"$f":"Eq.1!W9","v":5},{"$f":"Eq.2!W9","v":10},{"$f":"Eq.3!W9","v":9},{"$f":"Eq.4!W9","v":5},{"$f":"Eq.5!W9","v":6},{"$f":"Eq.6!W9","v":11},{"$f":"Eq.7!W9","v":4},{"$f":"Eq.8!W9","v":8},null,{"$f":"Eq.10!W9","v":6},64]
[null,10,{"$f":"Eq.1!W10","v":7},{"$f":"Eq.2!W10","v":2},{"$f":"Eq.3!W10","v":7},{"$f":"Eq.4!W10","v":11},{"$f":"Eq.5!W10","v":6},{"$f":"Eq.6!W10","v":7},{"$f":"Eq.7!W10","v":10},{"$f":"Eq.8!W10","v":8},{"$f":"Eq.9!W10","v":6},null,64]

{"sheet":"Eq.1","index":6,"n_rows":29,"n_cols":23,"rows_kept":29,"cut":false,"hidden":true,"merged":[[15,0,15,1],[14,0,14,1],[0,0,1,5],[0,6,1,10],[3,0,3,1],[4,0,4,1],[5,0,5,1],[13,0,13,1],[7,0,7,1],[8,0,8,1],[9,0,9,1],[10,0,10,1],[11,0,11,1],[12,0,12,1]]}
["Equipage ",null,null,null,null,null,{"$f":"Général!B3","v":"Equipage 1"},null,null,null,null,null,null,null,null,null,null,null,null,null,null,{"$f":"Général!B3","v":"Equipage 1"},{"$f":"COUNTIF(C$8:R$16,V1)","v":16}]
[null,null,null,null,null,null,null,null,null,null,null,null,null,null,null,null,null,null,null,null,null,{"$f":"Général!B4","v":"Equipage 2"},{"$f":"COUNTIF($C$8:$R$16,V2)","v":9}]
[null,null,null,null,null,null,null,null,null,null,null,null,null,null,null,null,null,null,null,null,null,{"$f":"Général!B5","v":"Equipage 3"},8]
[null,null,"FLIGHT 1","FLIGHT 2","FLIGHT 3","FLIGHT 4","FLIGHT 5","FLIGHT 6","FLIGHT 7","FLIGHT 8","FLIGHT 9","FLIGHT 10","FLIGHT 11","FLIGHT 12","FLIGHT 13","FLIGHT 14","FLIGHT 15","FLIGHT 16","FLIGHT 17","FLIGHT 18",null,{"$f":"Général!B6","v":"Equipage 4"},10]
["N° de course",null,{"$f":"IF(COUNTIF(Général!B34:K34,$G$1)=1,\"Course 1\",IF(COUNTIF(Général!B36:K36,$G$1)=1,\"Course 2\",IF(COUNTIF(Général!#REF!,$G$1)=1,\"Course 3\",\"Course 4\")))","v":"Course 1"},{"$f":"IF(COUNTIF(Général!B42:K42,$G$1)=1,\"Course 1\",IF(COUNTIF(Général!B44:K44,$G$1)=1,\"Course 2\",IF(COUNTIF(Général!#REF!,$G$1)=1,\"Course 3\",\"Course 4\")))","v":"Course 2"},{"$f":"IF(COUNTIF(Général!B50:K50,$G$1)=1,\"Course 1\",IF(COUNTIF(Général!B52:K52,$G$1)=1,\"Course 2\",IF(COUNTIF(Général!#REF!,$G$1)=1,\"Course 3\",\"Course 4\")))","v":"Course 2"},{"$f":"IF(COUNTIF(Général!B58:K58,$G$1)=1,\"Course 1\",IF(COUNTIF(Général!B60:K60,$G$1)=1,\"Course 2\",IF(COUNTIF(Général!#REF!,$G$1)=1,\"Course 3\",\"Course 4\")))","v":"Course 2"},{"$f":"IF(COUNTIF(Général!B66:K66,$G$1)=1,\"Course 1\",IF(COUNTIF(Général!B68:K68,$G$1)=1,\"Course 2\",IF(COUNTIF(Général!#REF!,$G$1)=1,\"Course 3\",\"Course 4\")))","v":"Course 2"},{"$f":"IF(COUNTIF(Général!B74:K74,$G$1)=1,\"Course 1\",IF(COUNTIF(Général!B76:K76,$G$1)=1,\"Course 2\",IF(COUNTIF(Général!#REF!,$G$1)=1,\"Course 3\",\"Course 4\")))","v":"Course 1"},{"$f":"IF(COUNTIF(Général!B82:K82,$G$1)=1,\"Course 1\",IF(COUNTIF(Général!B84:K84,$G$1)=1,\"Course 2\",IF(COUNTIF(Général!#REF!,$G$1)=1,\"Course 3\",\"Course 4\")))","v":"Course 2"},{"$f":"IF(COUNTIF(Général!B90:K90,$G$1)=1,\"Course 1\",IF(COUNTIF(Général!B92:K92,$G$1)=1,\"Course 2\",IF(COUNTIF(Général!#REF!,$G$1)=1,\"Course 3\",\"Course 4\")))","v":"Course 2"},{"$f":"IF(COUNTIF(Général!B98:K98,$G$1)=1,\"Course 1\",IF(COUNTIF(Général!B100:K100,$G$1)=1,\"Course 2\",IF(COUNTIF(Général!#REF!,$G$1)=1,\"Course 3\",\"Course 4\")))","v":"Course 1"},{"$f":"IF(COUNTIF(Général!B106:K106,$G$1)=1,\"Course 1\",IF(COUNTIF(Général!B108:K108,$G$1)=1,\"Course 2\",IF(COUNTIF(Général!#REF!,$G$1)=1,\"Course 3\",\"Course 4\")))","v":"Course 2"},{"$f":"IF(COUNTIF(Général!B114:K114,$G$1)=1,\"Course 1\",IF(COUNTIF(Général!B116:K116,$G$1)=1,\"Course 2\",IF(COUNTIF(Général!#REF!,$G$1)=1,\"Course 3\",\"Course 4\")))","v":"Course 2"},{"$f":"IF(COUNTIF(Général!B122:K122,$G$1)=1,\"Course 1\",IF(COUNTIF(Général!B124:K124,$G$1)=1,\"Course 2\",IF(COUNTIF(Général!#REF!,$G$1)=1,\"Course 3\",\"Course 4\")))","v":"Course 2"},{"$f":"IF(COUNTIF(Général!B130:K130,$G$1)=1,\"Course 1\",IF(COUNTIF(Général!B132:K132,$G$1)=1,\"Course 2\",IF(COUNTIF(Général!#REF!,$G$1)=1,\"Course 3\",\"Course 4\")))","v":"Course 1"},{"$f":"IF(COUNTIF(Général!B138:K138,$G$1)=1,\"Course 1\",IF(COUNTIF(Général!B140:K140,$G$1)=1,\"Course 2\",IF(COUNTIF(Général!#REF!,$G$1)=1,\"Course 3\",\"Course 4\")))","v":"Course 2"},{"$f":"IF(COUNTIF(Général!B146:K146,$G$1)=1,\"Course 1\",IF(COUNTIF(Général!B148:K148,$G$1)=1,\"Course 2\",IF(COUNTIF(Général!#REF!,$G$1)=1,\"Course 3\",\"Course 4\")))","v":"Course 1"},{"$f":"IF(COUNTIF(Général!B154:K154,$G$1)=1,\"Course 1\",IF(COUNTIF(Général!B156:K156,$G$1)=1,\"Course 2\",IF(COUNTIF(Général!B158:K158,$G$1)=1,\"Course 3\",\"Course 4\")))","v":"Course 1"},{"$f":"IF(COUNTIF(Général!C154:L154,$G$1)=1,\"Course 1\",IF(COUNTIF(Général!C156:L156,$G$1)=1,\"Course 2\",IF(COUNTIF(Général!C158:L158,$G$1)=1,\"Course 3\",\"Course 4\")))","v":"Course 4"},{"$f":"IF(COUNTIF(Général!D154:M154,$G$1)=1,\"Course 1\",IF(COUNTIF(Général!D156:M156,$G$1)=1,\"Course 2\",IF(COUNTIF(Général!D158:M158,$G$1)=1,\"Course 3\",\"Course 4\")))","v":"Course 4"},null,{"$f":"Général!B7","v":"Equipage 5"},5]
["Bateau",null,{"$f":"IF(COUNTIF(Général!B34:B38,$G$1)=1,\"Boat 1\",IF(COUNTIF(Général!C34:C38,$G$1)=1,\"Boat 2\",IF(COUNTIF(Général!D34:D38,$G$1)=1,\"Boat 3\",IF(COUNTIF(Général!E34:E38,$G$1)=1,\"Boat 4\",IF(COUNTIF(Général!F34:F38,$G$1)=1,\"Boat 5\",IF(COUNTIF(Général!G34:G38,$G$1)=1,\"Boat 6\",IF(COUNTIF(Général!H34:H38,$G$1)=1,\"Boat 7\",IF(COUNTIF(Général!I34:I38,$G$1)=1,\"Boat 8\",IF(COUNTIF(Général!J34:J38,$G$1)=1,\"Boat 9\",\"Boat10\")))))))))","v":"Boat 5"},{"$f":"IF(COUNTIF(Général!B42:B46,$G$1)=1,\"Boat 1\",IF(COUNTIF(Général!C42:C46,$G$1)=1,\"Boat 2\",IF(COUNTIF(Général!D42:D46,$G$1)=1,\"Boat 3\",IF(COUNTIF(Général!E42:E46,$G$1)=1,\"Boat 4\",IF(COUNTIF(Général!F42:F46,$G$1)=1,\"Boat 5\",IF(COUNTIF(Général!G42:G46,$G$1)=1,\"Boat 6\",IF(COUNTIF(Général!H42:H46,$G$1)=1,\"Boat 7\",IF(COUNTIF(Général!I42:I46,$G$1)=1,\"Boat 8\",IF(COUNTIF(Général!J42:J46,$G$1)=1,\"Boat 9\",\"Boat 10\")))))))))","v":"Boat 4"},{"$f":"IF(COUNTIF(Général!B50:B54,$G$1)=1,\"Boat 1\",IF(COUNTIF(Général!C50:C54,$G$1)=1,\"Boat 2\",IF(COUNTIF(Général!D50:D54,$G$1)=1,\"Boat 3\", IF(COUNTIF(Général!E50:E54,$G$1)=1,\"Boat 4\", IF(COUNTIF(Général!F50:F54,$G$1)=1,\"Boat 5\", IF(COUNTIF(Général!G50:G54,$G$1)=1,\"Boat 6\", IF(COUNTIF(Général!H50:H54,$G$1)=1,\"Boat 7\",IF(COUNTIF(Général!I50:I54,$G$1)=1,\"Boat 8\",IF(COUNTIF(Général!J50:J54,$G$1)=1,\"Boat 9\",\"Boat 10\")))))))))","v":"Boat 1"},{"$f":"IF(COUNTIF(Général!B58:B62,$G$1)=1,\"Boat 1\",IF(COUNTIF(Général!C58:C62,$G$1)=1,\"Boat 2\",IF(COUNTIF(Général!D58:D62,$G$1)=1,\"Boat 3\", IF(COUNTIF(Général!E58:E62,$G$1)=1,\"Boat 4\", IF(COUNTIF(Général!F58:F62,$G$1)=1,\"Boat 5\", IF(COUNTIF(Général!G58:G62,$G$1)=1,\"Boat 6\", IF(COUNTIF(Général!H58:H62,$G$1)=1,\"Boat 7\",IF(COUNTIF(Général!I58:I62,$G$1)=1,\"Boat 8\",IF(COUNTIF(Général!I58:J62,$G$1)=1,\"Boat 9\",\"Boat 10\")))))))))","v":"Boat 5"},{"$f":"IF(COUNTIF(Général!B66:B70,$G$1)=1,\"Boat 1\",IF(COUNTIF(Général!C66:C70,$G$1)=1,\"Boat 2\",IF(COUNTIF(Général!D66:D70,$G$1)=1,\"Boat 3\", IF(COUNTIF(Général!E66:E70,$G$1)=1,\"Boat 4\", IF(COUNTIF(Général!F66:F70,$G$1)=1,\"Boat 5\", IF(COUNTIF(Général!G66:G70,$G$1)=1,\"Boat 6\", IF(COUNTIF(Général!H66:H70,$G$1)=1,\"Boat 7\",IF(COUNTIF(Général!I66:I70,$G$1)=1,\"Boat 8\",IF(COUNTIF(Général!J66:J70,$G$1)=1,\"Boat 9\",\"Boat 10\")))))))))","v":"Boat 5"},{"$f":"IF(COUNTIF(Général!B74:B78,$G$1)=1,\"Boat 1\",IF(COUNTIF(Général!C74:C78,$G$1)=1,\"Boat 2\",IF(COUNTIF(Général!D74:D78,$G$1)=1,\"Boat 3\", IF(COUNTIF(Général!E74:E78,$G$1)=1,\"Boat 4\", IF(COUNTIF(Général!F74:F78,$G$1)=1,\"Boat 5\", IF(COUNTIF(Général!G74:G78,$G$1)=1,\"Boat 6\", IF(COUNTIF(Général!H74:H78,$G$1)=1,\"Boat 7\",IF(COUNTIF(Général!I74:I78,$G$1)=1,\"Boat 8\",IF(COUNTIF(Général!J74:J78,$G$1)=1,\"Boat 9\",\"Boat 10\")))))))))","v":"Boat 5"},{"$f":"IF(COUNTIF(Général!B82:B86,$G$1)=1,\"Boat 1\",IF(COUNTIF(Général!C82:C86,$G$1)=1,\"Boat 2\",IF(COUNTIF(Général!D82:D86,$G$1)=1,\"Boat 3\", IF(COUNTIF(Général!E82:E86,$G$1)=1,\"Boat 4\", IF(COUNTIF(Général!F82:F86,$G$1)=1,\"Boat 5\", IF(COUNTIF(Général!G82:G86,$G$1)=1,\"Boat 6\", IF(COUNTIF(Général!H82:H86,$G$1)=1,\"Boat 7\",IF(COUNTIF(Général!I82:I86,$G$1)=1,\"Boat 8\",IF(COUNTIF(Général!J82:J86,$G$1)=1,\"Boat 9\",\"Boat 10\")))))))))","v":"Boat 3"},{"$f":"IF(COUNTIF(Général!B90:B94,$G$1)=1,\"Boat 1\",IF(COUNTIF(Général!C90:C94,$G$1)=1,\"Boat 2\",IF(COUNTIF(Général!D90:D94,$G$1)=1,\"Boat 3\", IF(COUNTIF(Général!E90:E94,$G$1)=1,\"Boat 4\", IF(COUNTIF(Général!F90:F94,$G$1)=1,\"Boat 5\", IF(COUNTIF(Général!G90:G94,$G$1)=1,\"Boat 6\", IF(COUNTIF(Général!H90:H94,$G$1)=1,\"Boat 7\",IF(COUNTIF(Général!I90:I94,$G$1)=1,\"Boat 8\",IF(COUNTIF(Général!J90:J94,$G$1)=1,\"Boat 9\",\"Boat 10\")))))))))","v":"Boat 2"},{"$f":"IF(COUNTIF(Général!B98:B102,$G$1)=1,\"Boat 1\",IF(COUNTIF(Général!C98:C102,$G$1)=1,\"Boat 2\",IF(COUNTIF(Général!D98:D102,$G$1)=1,\"Boat 3\", IF(COUNTIF(Général!E98:E102,$G$1)=1,\"Boat 4\", IF(COUNTIF(Général!F98:F102,$G$1)=1,\"Boat 5\", IF(COUNTIF(Général!G98:G102,$G$1)=1,\"Boat 6\", IF(COUNTIF(Général!H98:H102,$G$1)=1,\"Boat 7\",IF(COUNTIF(Général!I98:I102,$G$1)=1,\"Boat 8\",IF(COUNTIF(Général!J98:J102,$G$1)=1,\"Boat 9\",\"Boat 10\")))))))))","v":"Boat 2"},{"$f":"IF(COUNTIF(Général!B106:B110,$G$1)=1,\"Boat 1\",IF(COUNTIF(Général!C106:C110,$G$1)=1,\"Boat 2\",IF(COUNTIF(Général!D106:D110,$G$1)=1,\"Boat 3\", IF(COUNTIF(Général!E106:E110,$G$1)=1,\"Boat 4\", IF(COUNTIF(Général!F106:F110,$G$1)=1,\"Boat 5\", IF(COUNTIF(Général!G106:G110,$G$1)=1,\"Boat 6\", IF(COUNTIF(Général!H106:H110,$G$1)=1,\"Boat 7\",IF(COUNTIF(Général!I106:I110,$G$1)=1,\"Boat 8\",IF(COUNTIF(Général!J106:J110,$G$1)=1,\"Boat 9\",\"Boat 10\")))))))))","v":"Boat 3"},{"$f":"IF(COUNTIF(Général!B114:B118,$G$1)=1,\"Boat 1\",IF(COUNTIF(Général!C114:C118,$G$1)=1,\"Boat 2\",IF(COUNTIF(Général!C114:D118,$G$1)=1,\"Boat 3\", IF(COUNTIF(Général!C114:E118,$G$1)=1,\"Boat 4\", IF(COUNTIF(Général!F114:F118,$G$1)=1,\"Boat 5\", IF(COUNTIF(Général!G114:G118,$G$1)=1,\"Boat 6\", IF(COUNTIF(Général!H114:H118,$G$1)=1,\"Boat 7\",IF(COUNTIF(Général!I114:I118,$G$1)=1,\"Boat 8\",IF(COUNTIF(Général!J114:J118,$G$1)=1,\"Boat 9\",\"Boat 10\")))))))))","v":"Boat 1"},{"$f":"IF(COUNTIF(Général!B122:B126,$G$1)=1,\"Boat 1\",IF(COUNTIF(Général!C122:C126,$G$1)=1,\"Boat 2\",IF(COUNTIF(Général!D122:D126,$G$1)=1,\"Boat 3\", IF(COUNTIF(Général!E122:E126,$G$1)=1,\"Boat 4\", IF(COUNTIF(Général!F122:F126,$G$1)=1,\"Boat 5\", IF(COUNTIF(Général!G122:G126,$G$1)=1,\"Boat 6\", IF(COUNTIF(Général!H122:H126,$G$1)=1,\"Boat 7\",IF(COUNTIF(Général!I122:I126,$G$1)=1,\"Boat 8\",IF(COUNTIF(Général!J122:J126,$G$1)=1,\"Boat 9\",\"Boat 10\")))))))))","v":"Boat 4"},{"$f":"IF(COUNTIF(Général!B130:B134,$G$1)=1,\"Boat 1\",IF(COUNTIF(Général!C130:C134,$G$1)=1,\"Boat 2\",IF(COUNTIF(Général!D130:D134,$G$1)=1,\"Boat 3\", IF(COUNTIF(Général!E130:E134,$G$1)=1,\"Boat 4\", IF(COUNTIF(Général!F130:F134,$G$1)=1,\"Boat 5\", IF(COUNTIF(Général!G130:G134,$G$1)=1,\"Boat 6\", IF(COUNTIF(Général!H130:H134,$G$1)=1,\"Boat 7\",IF(COUNTIF(Général!I130:I134,$G$1)=1,\"Boat 8\",IF(COUNTIF(Général!J130:J134,$G$1)=1,\"Boat 9\",\"Boat 10\")))))))))","v":"Boat 4"},{"$f":"IF(COUNTIF(Général!B138:B142,$G$1)=1,\"Boat 1\",IF(COUNTIF(Général!C138:C142,$G$1)=1,\"Boat 2\",IF(COUNTIF(Général!D138:D142,$G$1)=1,\"Boat 3\", IF(COUNTIF(Général!E138:E142,$G$1)=1,\"Boat 4\", IF(COUNTIF(Général!F138:F142,$G$1)=1,\"Boat 5\", IF(COUNTIF(Général!G138:G142,$G$1)=1,\"Boat 6\", IF(COUNTIF(Général!H138:H142,$G$1)=1,\"Boat 7\",IF(COUNTIF(Général!I138:I142,$G$1)=1,\"Boat 8\",IF(COUNTIF(Général!J138:J142,$G$1)=1,\"Boat 9\",\"Boat 10\")))))))))","v":"Boat 2"},{"$f":"IF(COUNTIF(Général!B146:B150,$G$1)=1,\"Boat 1\",IF(COUNTIF(Général!C146:C150,$G$1)=1,\"Boat 2\",IF(COUNTIF(Général!D146:D150,$G$1)=1,\"Boat 3\", IF(COUNTIF(Général!E146:E150,$G$1)=1,\"Boat 4\", IF(COUNTIF(Général!F146:F150,$G$1)=1,\"Boat 5\", IF(COUNTIF(Général!G146:G150,$G$1)=1,\"Boat 6\", IF(COUNTIF(Général!H146:H150,$G$1)=1,\"Boat 7\",IF(COUNTIF(Général!I146:I150,$G$1)=1,\"Boat 8\",IF(COUNTIF(Général!J146:J150,$G$1)=1,\"Boat 9\",\"Boat 10\")))))))))","v":"Boat 2"},{"$f":"IF(COUNTIF(Général!B154:B157,$G$1)=1,\"Boat 1\",IF(COUNTIF(Général!C154:C157,$G$1)=1,\"Boat 2\",IF(COUNTIF(Général!D154:D157,$G$1)=1,\"Boat 3\", IF(COUNTIF(Général!E154:E157,$G$1)=1,\"Boat 4\", IF(COUNTIF(Général!F154:F157,$G$1)=1,\"Boat 5\", IF(COUNTIF(Général!G154:G157,$G$1)=1,\"Boat 6\", IF(COUNTIF(Général!H154:H157,$G$1)=1,\"Boat 7\",IF(COUNTIF(Général!I154:I157,$G$1)=1,\"Boat 8\",IF(COUNTIF(Général!J154:J157,$G$1)=1,\"Boat 9\",\"Boat 10\")))))))))","v":"Boat 1"},{"$f":"IF(COUNTIF(Général!B160:B163,$G$1)=1,\"Boat 1\",IF(COUNTIF(Général!C160:C163,$G$1)=1,\"Boat 2\",IF(COUNTIF(Général!D160:D163,$G$1)=1,\"Boat 3\", IF(COUNTIF(Général!E160:E163,$G$1)=1,\"Boat 4\", IF(COUNTIF(Général!F160:F163,$G$1)=1,\"Boat 5\", IF(COUNTIF(Général!G160:G163,$G$1)=1,\"Boat 6\", IF(COUNTIF(Général!H160:H163,$G$1)=1,\"Boat 7\",IF(COUNTIF(Général!I160:I163,$G$1)=1,\"Boat 8\",IF(COUNTIF(Général!J160:J163,$G$1)=1,\"Boat 9\",\"Boat 10\")))))))))","v":"Boat 1"},{"$f":"IF(COUNTIF(Général!B166:B169,$G$1)=1,\"Boat 1\",IF(COUNTIF(Général!C166:C169,$G$1)=1,\"Boat 2\",IF(COUNTIF(Général!D166:D169,$G$1)=1,\"Boat 3\", IF(COUNTIF(Général!E166:E169,$G$1)=1,\"Boat 4\", IF(COUNTIF(Général!F166:F169,$G$1)=1,\"Boat 5\", IF(COUNTIF(Général!G166:G169,$G$1)=1,\"Boat 6\", IF(COUNTIF(Général!H166:H169,$G$1)=1,\"Boat 7\",IF(COUNTIF(Général!I166:I169,$G$1)=1,\"Boat 8\",IF(COUNTIF(Général!J166:J169,$G$1)=1,\"Boat 9\",\"Boat 10\")))))))))","v":"Boat 1"},null,{"$f":"Général!B8","v":"Equipage 6"},6]
[null,null,null,null,null,null,null,null,null,null,null,null,null,null,null,null,null,null,null,null,null,{"$f":"Général!B9","v":"Equipage 7"},7]
["1er Equipage",null,{"$f":"IF($C$5=\"Course 1\",Général!B34,IF($C$5=\"Course 2\",Général!B36,IF($C$5=\"Course 3\",Général!#REF!,Général!B38)))","v":"Equipage 7"},{"$f":"IF($D$5=\"Course 1\",Général!B42,IF($D$5=\"Course 2\",Général!B44,IF($D$5=\"Course 3\",Général!#REF!,Général!B46)))","v":"Equipage 5"},{"$f":"IF($E$5=\"Course 1\",Général!B50,IF($E$5=\"Course 2\",Général!B52,IF($E$5=\"Course 3\",Général!#REF!,Général!B54)))","v":"Equipage 1"},{"$f":"IF($F$5=\"Course 1\",Général!B$58,IF($F$5=\"Course 2\",Général!B$60,IF($F$5=\"Course 3\",Général!#REF!,Général!B$62)))","v":"Equipage 2"},{"$f":"IF($G$5=\"Course 1\",Général!B$66,IF($G$5=\"Course 2\",Général!B$68,IF($G$5=\"Course 3\",Général!#REF!,Général!B$70)))","v":"Equipage 4"},{"$f":"IF($H$5=\"Course 1\",Général!B$74,IF($H$5=\"Course 2\",Général!B$76,IF($H$5=\"Course 3\",Général!#REF!,Général!B$78)))","v":"Equipage 3"},{"$f":"IF($I$5=\"Course 1\",Général!B$82,IF($I$5=\"Course 2\",Général!B$84,IF($I$5=\"Course 3\",Général!#REF!,Général!B$86)))","v":"Equipage 6"},{"$f":"IF($J$5=\"Course 1\",Général!B$90,IF($J$5=\"Course 2\",Général!B$92,IF($J$5=\"Course 3\",Général!#REF!,Général!B$94)))","v":"Equipage 10"},{"$f":"IF($K$5=\"Course 1\",Général!B$98,IF($K$5=\"Course 2\",Général!B$100,IF($K$5=\"Course 3\",Général!#REF!,Général!B$102)))","v":"Equipage 6"},{"$f":"IF($L$5=\"Course 1\",Général!B$106,IF($L$5=\"Course 2\",Général!B$108,IF($L$5=\"Course 3\",Général!#REF!,Général!B$110)))","v":"Equipage 10"},{"$f":"IF($M$5=\"Course 1\",Général!B$114,IF($M$5=\"Course 2\",Général!B$116,IF($M$5=\"Course 3\",Général!#REF!,Général!B$118)))","v":"Equipage 1"},{"$f":"IF($N$5=\"Course 1\",Général!B$122,IF($N$5=\"Course 2\",Général!B$124,IF($N$5=\"Course 3\",Général!#REF!,Général!B$126)))","v":"Equipage 8"},{"$f":"IF($O$5=\"Course 1\",Général!B$130,IF($O$5=\"Course 2\",Général!B$132,IF($O$5=\"Course 3\",Général!#REF!,Général!B$134)))","v":"Equipage 8"},{"$f":"IF($P$5=\"Course 1\",Général!B$138,IF($P$5=\"Course 2\",Général!B$140,IF($P$5=\"Course 3\",Général!#REF!,Général!B$142)))","v":"Equipage 7"},{"$f":"IF($Q$5=\"Course 1\",Général!B$146,IF($Q$5=\"Course 2\",Général!B$148,IF($Q$5=\"Course 3\",Général!#REF!,Général!B$150)))","v":"Equipage 8"},{"$f":"IF($R$5=\"Course 1\",Général!B$154,IF($R$5=\"Course 2\",Général!B$156,IF($R$5=\"Course 3\",Général!B$158,Général!B$160)))","v":"Equipage 1"},null,null,null,{"$f":"Général!B10","v":"Equipage 8"},7]
["2nd Equipage",null,{"$f":"IF($C$5=\"Course 1\",Général!C34,IF($C$5=\"Course 2\",Général!C36,IF($C$5=\"Course 3\",Général!#REF!,Général!C38)))","v":"Equipage 10"},{"$f":"IF($D$5=\"Course 1\",Général!C42,IF($D$5=\"Course 2\",Général!C44,IF($D$5=\"Course 3\",Général!#REF!,Général!C46)))","v":"Equipage 2"},{"$f":"IF($E$5=\"Course 1\",Général!C50,IF($E$5=\"Course 2\",Général!C52,IF($E$5=\"Course 3\",Général!#REF!,Général!C54)))","v":"Equipage 2"},{"$f":"IF($F$5=\"Course 1\",Général!C$58,IF($F$5=\"Course 2\",Général!C$60,IF($F$5=\"Course 3\",Général!#REF!,Général!C$62)))","v":"Equipage 4"},{"$f":"IF($G$5=\"Course 1\",Général!C$66,IF($G$5=\"Course 2\",Général!C$68,IF($G$5=\"Course 3\",Général!#REF!,Général!C$70)))","v":"Equipage 10"},{"$f":"IF($H$5=\"Course 1\",Général!C$74,IF($H$5=\"Course 2\",Général!C$76,IF($H$5=\"Course 3\",Général!#REF!,Général!C$78)))","v":"Equipage 7"},{"$f":"IF($I$5=\"Course 1\",Général!C$82,IF($I$5=\"Course 2\",Général!C$84,IF($I$5=\"Course 3\",Général!#REF!,Général!C$86)))","v":"Equipage 9"},{"$f":"IF($J$5=\"Course 1\",Général!C$90,IF($J$5=\"Course 2\",Général!C$92,IF($J$5=\"Course 3\",Général!#REF!,Général!C$94)))","v":"Equipage 1"},{"$f":"IF($K$5=\"Course 1\",Général!C$98,IF($K$5=\"Course 2\",Général!C$100,IF($K$5=\"Course 3\",Général!#REF!,Général!C$102)))","v":"Equipage 1"},{"$f":"IF($L$5=\"Course 1\",Général!C$106,IF($L$5=\"Course 2\",Général!C$108,IF($L$5=\"Course 3\",Général!#REF!,Général!C$110)))","v":"Equipage 4"},{"$f":"IF($M$5=\"Course 1\",Général!C$114,IF($M$5=\"Course 2\",Général!C$116,IF($M$5=\"Course 3\",Général!#REF!,Général!C$118)))","v":"Equipage 7"},{"$f":"IF($N$5=\"Course 1\",Général!C$122,IF($N$5=\"Course 2\",Général!C$124,IF($N$5=\"Course 3\",Général!#REF!,Général!C$126)))","v":"Equipage 5"},{"$f":"IF($O$5=\"Course 1\",Général!C$130,IF($O$5=\"Course 2\",Général!C$132,IF($O$5=\"Course 3\",Général!#REF!,Général!C$134)))","v":"Equipage 3"},{"$f":"IF($P$5=\"Course 1\",Général!C$138,IF($P$5=\"Course 2\",Général!C$140,IF($P$5=\"Course 3\",Général!#REF!,Général!C$142)))","v":"Equipage 1"},{"$f":"IF($Q$5=\"Course 1\",Général!C$146,IF($Q$5=\"Course 2\",Général!C$148,IF($Q$5=\"Course 3\",Général!#REF!,Général!C$150)))","v":"Equipage 1"},{"$f":"IF($R$5=\"Course 1\",Général!C$154,IF($R$5=\"Course 2\",Général!C$156,IF($R$5=\"Course 3\",Général!C$158,Général!C$160)))","v":"Equipage 7"},null,null,null,{"$f":"Général!B11","v":"Equipage 9"},5]
["3ème Equipage",null,{"$f":"IF($C$5=\"Course 1\",Général!D34,IF($C$5=\"Course 2\",Général!D36,IF($C$5=\"Course 3\",Général!#REF!,Général!D38)))","v":"Equipage 4"},{"$f":"IF($D$5=\"Course 1\",Général!D42,IF($D$5=\"Course 2\",Général!D44,IF($D$5=\"Course 3\",Général!#REF!,Général!D46)))","v":"Equipage 3"},{"$f":"IF($E$5=\"Course 1\",Général!D50,IF($E$5=\"Course 2\",Général!D52,IF($E$5=\"Course 3\",Général!#REF!,Général!D54)))","v":"Equipage 3"},{"$f":"IF($F$5=\"Course 1\",Général!D$58,IF($F$5=\"Course 2\",Général!D$60,IF($F$5=\"Course 3\",Général!#REF!,Général!D$62)))","v":"Equipage 8"},{"$f":"IF($G$5=\"Course 1\",Général!D$66,IF($G$5=\"Course 2\",Général!D$68,IF($G$5=\"Course 3\",Général!#REF!,Général!D$70)))","v":"Equipage 8"},{"$f":"IF($H$5=\"Course 1\",Général!D$74,IF($H$5=\"Course 2\",Général!D$76,IF($H$5=\"Course 3\",Général!#REF!,Général!D$78)))","v":"Equipage 2"},{"$f":"IF($I$5=\"Course 1\",Général!D$82,IF($I$5=\"Course 2\",Général!D$84,IF($I$5=\"Course 3\",Général!#REF!,Général!D$86)))","v":"Equipage 1"},{"$f":"IF($J$5=\"Course 1\",Général!D$90,IF($J$5=\"Course 2\",Général!D$92,IF($J$5=\"Course 3\",Général!#REF!,Général!D$94)))","v":"Equipage 3"},{"$f":"IF($K$5=\"Course 1\",Général!D$98,IF($K$5=\"Course 2\",Général!D$100,IF($K$5=\"Course 3\",Général!#REF!,Général!D$102)))","v":"Equipage 9"},{"$f":"IF($L$5=\"Course 1\",Général!D$106,IF($L$5=\"Course 2\",Général!D$108,IF($L$5=\"Course 3\",Général!#REF!,Général!D$110)))","v":"Equipage 1"},{"$f":"IF($M$5=\"Course 1\",Général!D$114,IF($M$5=\"Course 2\",Général!D$116,IF($M$5=\"Course 3\",Général!#REF!,Général!D$118)))","v":"Equipage 10"},{"$f":"IF($N$5=\"Course 1\",Général!D$122,IF($N$5=\"Course 2\",Général!D$124,IF($N$5=\"Course 3\",Général!#REF!,Général!D$126)))","v":"Equipage 7"},{"$f":"IF($O$5=\"Course 1\",Général!D$130,IF($O$5=\"Course 2\",Général!D$132,IF($O$5=\"Course 3\",Général!#REF!,Général!D$134)))","v":"Equipage 2"},{"$f":"IF($P$5=\"Course 1\",Général!D$138,IF($P$5=\"Course 2\",Général!D$140,IF($P$5=\"Course 3\",Général!#REF!,Général!D$142)))","v":"Equipage 10"},{"$f":"IF($Q$5=\"Course 1\",Général!D$146,IF($Q$5=\"Course 2\",Général!D$148,IF($Q$5=\"Course 3\",Général!#REF!,Général!D$150)))","v":"Equipage 2"},{"$f":"IF($R$5=\"Course 1\",Général!D$154,IF($R$5=\"Course 2\",Général!D$156,IF($R$5=\"Course 3\",Général!D$158,Général!D$160)))","v":"Equipage 10"},null,null,null,{"$f":"Général!B12","v":"Equipage 10"},7]
["4ème Equipage",null,{"$f":"IF($C$5=\"Course 1\",Général!E34,IF($C$5=\"Course 2\",Général!E36,IF($C$5=\"Course 3\",Général!#REF!,Général!E38)))","v":"Equipage 6"},{"$f":"IF($D$5=\"Course 1\",Général!E42,IF($D$5=\"Course 2\",Général!E44,IF($D$5=\"Course 3\",Général!#REF!,Général!E46)))","v":"Equipage 1"},{"$f":"IF($E$5=\"Course 1\",Général!E50,IF($E$5=\"Course 2\",Général!E52,IF($E$5=\"Course 3\",Général!#REF!,Général!E54)))","v":"Equipage 9"},{"$f":"IF($F$5=\"Course 1\",Général!E$58,IF($F$5=\"Course 2\",Général!E$60,IF($F$5=\"Course 3\",Général!#REF!,Général!E$62)))","v":"Equipage 5"},{"$f":"IF($G$5=\"Course 1\",Général!E$66,IF($G$5=\"Course 2\",Général!E$68,IF($G$5=\"Course 3\",Général!#REF!,Général!E$70)))","v":"Equipage 5"},{"$f":"IF($H$5=\"Course 1\",Général!E$74,IF($H$5=\"Course 2\",Général!E$76,IF($H$5=\"Course 3\",Général!#REF!,Général!E$78)))","v":"Equipage 6"},{"$f":"IF($I$5=\"Course 1\",Général!E$82,IF($I$5=\"Course 2\",Général!E$84,IF($I$5=\"Course 3\",Général!#REF!,Général!E$86)))","v":"Equipage 3"},{"$f":"IF($J$5=\"Course 1\",Général!E$90,IF($J$5=\"Course 2\",Général!E$92,IF($J$5=\"Course 3\",Général!#REF!,Général!E$94)))","v":"Equipage 2"},{"$f":"IF($K$5=\"Course 1\",Général!E$98,IF($K$5=\"Course 2\",Général!E$100,IF($K$5=\"Course 3\",Général!#REF!,Général!E$102)))","v":"Equipage 2"},{"$f":"IF($L$5=\"Course 1\",Général!E$106,IF($L$5=\"Course 2\",Général!E$108,IF($L$5=\"Course 3\",Général!#REF!,Général!E$110)))","v":"Equipage 8"},{"$f":"IF($M$5=\"Course 1\",Général!E$114,IF($M$5=\"Course 2\",Général!E$116,IF($M$5=\"Course 3\",Général!#REF!,Général!E$118)))","v":"Equipage 4"},{"$f":"IF($N$5=\"Course 1\",Général!E$122,IF($N$5=\"Course 2\",Général!E$124,IF($N$5=\"Course 3\",Général!#REF!,Général!E$126)))","v":"Equipage 1"},{"$f":"IF($O$5=\"Course 1\",Général!E$130,IF($O$5=\"Course 2\",Général!E$132,IF($O$5=\"Course 3\",Général!#REF!,Général!E$134)))","v":"Equipage 1"},{"$f":"IF($P$5=\"Course 1\",Général!E$138,IF($P$5=\"Course 2\",Général!E$140,IF($P$5=\"Course 3\",Général!#REF!,Général!E$142)))","v":"Equipage 4"},{"$f":"IF($Q$5=\"Course 1\",Général!E$146,IF($Q$5=\"Course 2\",Général!E$148,IF($Q$5=\"Course 3\",Général!#REF!,Général!E$150)))","v":"Equipage 4"},{"$f":"IF($R$5=\"Course 1\",Général!E$154,IF($R$5=\"Course 2\",Général!E$156,IF($R$5=\"Course 3\",Général!E$158,Général!E$160)))","v":"Equipage 6"}]
["5ème Equipage",null,{"$f":"IF($C$5=\"Course 1\",Général!F34,IF($C$5=\"Course 2\",Général!F36,IF($C$5=\"Course 3\",Général!#REF!,Général!F38)))","v":"Equipage 1"},{"$f":"IF($D$5=\"Course 1\",Général!F42,IF($D$5=\"Course 2\",Général!F44,IF($D$5=\"Course 3\",Général!#REF!,Général!F46)))","v":"Equipage 7"},{"$f":"IF($E$5=\"Course 1\",Général!F50,IF($E$5=\"Course 2\",Général!F52,IF($E$5=\"Course 3\",Général!#REF!,Général!F54)))","v":"Equipage 6"},{"$f":"IF($F$5=\"Course 1\",Général!F$58,IF($F$5=\"Course 2\",Général!F$60,IF($F$5=\"Course 3\",Général!#REF!,Général!F$62)))","v":"Equipage 1"},{"$f":"IF($G$5=\"Course 1\",Général!F$66,IF($G$5=\"Course 2\",Général!F$68,IF($G$5=\"Course 3\",Général!#REF!,Général!F$70)))","v":"Equipage 1"},{"$f":"IF($H$5=\"Course 1\",Général!F$74,IF($H$5=\"Course 2\",Général!F$76,IF($H$5=\"Course 3\",Général!#REF!,Général!F$78)))","v":"Equipage 1"},{"$f":"IF($I$5=\"Course 1\",Général!F$82,IF($I$5=\"Course 2\",Général!F$84,IF($I$5=\"Course 3\",Général!#REF!,Général!F$86)))","v":"Equipage 2"},{"$f":"IF($J$5=\"Course 1\",Général!F$90,IF($J$5=\"Course 2\",Général!F$92,IF($J$5=\"Course 3\",Général!#REF!,Général!F$94)))","v":"Equipage 8"},{"$f":"IF($K$5=\"Course 1\",Général!F$98,IF($K$5=\"Course 2\",Général!F$100,IF($K$5=\"Course 3\",Général!#REF!,Général!F$102)))","v":"Equipage 4"},{"$f":"IF($L$5=\"Course 1\",Général!F$106,IF($L$5=\"Course 2\",Général!$F108,IF($L$5=\"Course 3\",Général!#REF!,Général!F$110)))","v":"Equipage 9"},{"$f":"IF($M$5=\"Course 1\",Général!F$114,IF($M$5=\"Course 2\",Général!F$116,IF($M$5=\"Course 3\",Général!#REF!,Général!F$118)))","v":"Equipage 3"},{"$f":"IF($N$5=\"Course 1\",Général!F$122,IF($N$5=\"Course 2\",Général!F$124,IF($N$5=\"Course 3\",Général!#REF!,Général!F$126)))","v":"Equipage 4"},{"$f":"IF($O$5=\"Course 1\",Général!F$130,IF($O$5=\"Course 2\",Général!F$132,IF($O$5=\"Course 3\",Général!#REF!,Général!F$134)))","v":"Equipage 9"},{"$f":"IF($P$5=\"Course 1\",Général!F$138,IF($P$5=\"Course 2\",Général!F$140,IF($P$5=\"Course 3\",Général!#REF!,Général!F$142)))","v":"Equipage 3"},{"$f":"IF($Q$5=\"Course 1\",Général!F$146,IF($Q$5=\"Course 2\",Général!F$148,IF($Q$5=\"Course 3\",Général!#REF!,Général!F$150)))","v":"Equipage 5"},{"$f":"IF($R$5=\"Course 1\",Général!F$154,IF($R$5=\"Course 2\",Général!F$156,IF($R$5=\"Course 3\",Général!F$158,Général!F$160)))","v":"Equipage 4"}]
["7ème Equipage",null,{"$f":"IF($C$5=\"Course 1\",Général!H34,IF($C$5=\"Course 2\",Général!H36,IF($C$5=\"Course 3\",Général!#REF!,Général!H38)))","v":0},{"$f":"IF($D$5=\"Course 1\",Général!H42,IF($D$5=\"Course 2\",Général!H44,IF($D$5=\"Course 3\",Général!#REF!,Général!H46)))","v":0},{"$f":"IF($E$5=\"Course 1\",Général!H50,IF($E$5=\"Course 2\",Général!H52,IF($E$5=\"Course 3\",Général!#REF!,Général!H54)))","v":0},{"$f":"IF($F$5=\"Course 1\",Général!H$58,IF($F$5=\"Course 2\",Général!H$60,IF($F$5=\"Course 3\",Général!#REF!,Général!H$62)))","v":0},{"$f":"IF($G$5=\"Course 1\",Général!H$66,IF($G$5=\"Course 2\",Général!H$68,IF($G$5=\"Course 3\",Général!#REF!,Général!H$70)))","v":0},{"$f":"IF($H$5=\"Course 1\",Général!H$74,IF($H$5=\"Course 2\",Général!H$76,IF($H$5=\"Course 3\",Général!#REF!,Général!H$78)))","v":0},{"$f":"IF($I$5=\"Course 1\",Général!H$82,IF($I$5=\"Course 2\",Général!H$84,IF($I$5=\"Course 3\",Général!#REF!,Général!H$86)))","v":0},{"$f":"IF($J$5=\"Course 1\",Général!H$90,IF($J$5=\"Course 2\",Général!H$92,IF($J$5=\"Course 3\",Général!#REF!,Général!H$94)))","v":0},{"$f":"IF($K$5=\"Course 1\",Général!H$98,IF($K$5=\"Course 2\",Général!H$100,IF($K$5=\"Course 3\",Général!#REF!,Général!H$102)))","v":0},{"$f":"IF($L$5=\"Course 1\",Général!H$106,IF($L$5=\"Course 2\",Général!H$108,IF($L$5=\"Course 3\",Général!#REF!,Général!H$110)))","v":0},{"$f":"IF($M$5=\"Course 1\",Général!H$114,IF($M$5=\"Course 2\",Général!H$116,IF($M$5=\"Course 3\",Général!#REF!,Général!H$118)))","v":0},{"$f":"IF($N$5=\"Course 1\",Général!H$122,IF($N$5=\"Course 2\",Général!H$124,IF($N$5=\"Course 3\",Général!#REF!,Général!H$126)))","v":0},{"$f":"IF($O$5=\"Course 1\",Général!H$130,IF($O$5=\"Course 2\",Général!H$132,IF($O$5=\"Course 3\",Général!#REF!,Général!H$134)))","v":0},{"$f":"IF($P$5=\"Course 1\",Général!H$138,IF($P$5=\"Course 2\",Général!H$140,IF($P$5=\"Course 3\",Général!#REF!,Général!H$142)))","v":0},{"$f":"IF($Q$5=\"Course 1\",Général!H$146,IF($Q$5=\"Course 2\",Général!H$148,IF($Q$5=\"Course 3\",Général!#REF!,Général!H$150)))","v":0},{"$f":"IF($R$5=\"Course 1\",Général!H$154,IF($R$5=\"Course 2\",Général!H$156,IF($R$5=\"Course 3\",Général!H$158,Général!H$160)))","v":0},null,null,null,{"$f":"Général!B14","v":"Equipage 14"},{"$f":"COUNTIF($C$8:$R$16,V13)","v":0}]
["8ème Equipage",null,{"$f":"IF($C$5=\"Course 1\",Général!I34,IF($C$5=\"Course 2\",Général!I36,IF($C$5=\"Course 3\",Général!#REF!,Général!I38)))","v":0},{"$f":"IF($D$5=\"Course 1\",Général!I42,IF($D$5=\"Course 2\",Général!I44,IF($D$5=\"Course 3\",Général!#REF!,Général!I46)))","v":0},{"$f":"IF($E$5=\"Course 1\",Général!I50,IF($E$5=\"Course 2\",Général!I52,IF($E$5=\"Course 3\",Général!#REF!,Général!I54)))","v":0},{"$f":"IF($F$5=\"Course 1\",Général!I$58,IF($F$5=\"Course 2\",Général!I$60,IF($F$5=\"Course 3\",Général!#REF!,Général!I$62)))","v":0},{"$f":"IF($G$5=\"Course 1\",Général!I$66,IF($G$5=\"Course 2\",Général!I$68,IF($G$5=\"Course 3\",Général!#REF!,Général!I$70)))","v":0},{"$f":"IF($H$5=\"Course 1\",Général!I$74,IF($H$5=\"Course 2\",Général!I$76,IF($H$5=\"Course 3\",Général!#REF!,Général!I$78)))","v":0},{"$f":"IF($I$5=\"Course 1\",Général!I$82,IF($I$5=\"Course 2\",Général!I$84,IF($I$5=\"Course 3\",Général!#REF!,Général!I$86)))","v":0},{"$f":"IF($J$5=\"Course 1\",Général!I$90,IF($J$5=\"Course 2\",Général!I$92,IF($J$5=\"Course 3\",Général!#REF!,Général!I$94)))","v":0},{"$f":"IF($K$5=\"Course 1\",Général!I$98,IF($K$5=\"Course 2\",Général!I$100,IF($K$5=\"Course 3\",Général!#REF!,Général!I$102)))","v":0},{"$f":"IF($L$5=\"Course 1\",Général!I$106,IF($L$5=\"Course 2\",Général!I$108,IF($L$5=\"Course 3\",Général!#REF!,Général!I$110)))","v":0},{"$f":"IF($M$5=\"Course 1\",Général!I$114,IF($M$5=\"Course 2\",Général!I$116,IF($M$5=\"Course 3\",Général!#REF!,Général!I$118)))","v":0},{"$f":"IF($N$5=\"Course 1\",Général!I$122,IF($N$5=\"Course 2\",Général!I$124,IF($N$5=\"Course 3\",Général!#REF!,Général!I$126)))","v":0},{"$f":"IF($O$5=\"Course 1\",Général!I$130,IF($O$5=\"Course 2\",Général!I$132,IF($O$5=\"Course 3\",Général!#REF!,Général!I$134)))","v":0},{"$f":"IF($P$5=\"Course 1\",Général!I$138,IF($P$5=\"Course 2\",Général!I$140,IF($P$5=\"Course 3\",Général!#REF!,Général!I$142)))","v":0},{"$f":"IF($Q$5=\"Course 1\",Général!I$146,IF($Q$5=\"Course 2\",Général!I$148,IF($Q$5=\"Course 3\",Général!#REF!,Général!I$150)))","v":0},{"$f":"IF($R$5=\"Course 1\",Général!I$154,IF($R$5=\"Course 2\",Général!I$156,IF($R$5=\"Course 3\",Général!I$158,Général!I$160)))","v":0},null,null,null,{"$f":"Général!B15","v":"Equipage 15"},0]
["9ème Equipage",null,{"$f":"IF($C$5=\"Course 1\",Général!J34,IF($C$5=\"Course 2\",Général!J36,IF($C$5=\"Course 3\",Général!#REF!,Général!J38)))","v":0},{"$f":"IF($D$5=\"Course 1\",Général!J42,IF($D$5=\"Course 2\",Général!J44,IF($D$5=\"Course 3\",Général!#REF!,Général!J46)))","v":0},{"$f":"IF($E$5=\"Course 1\",Général!J50,IF($E$5=\"Course 2\",Général!J52,IF($E$5=\"Course 3\",Général!#REF!,Général!J54)))","v":0},{"$f":"IF($F$5=\"Course 1\",Général!J$58,IF($F$5=\"Course 2\",Général!J$60,IF($F$5=\"Course 3\",Général!#REF!,Général!J$62)))","v":0},{"$f":"IF($G$5=\"Course 1\",Général!J$66,IF($G$5=\"Course 2\",Général!J$68,IF($G$5=\"Course 3\",Général!#REF!,Général!J$70)))","v":0},{"$f":"IF($H$5=\"Course 1\",Général!J$74,IF($H$5=\"Course 2\",Général!J$76,IF($H$5=\"Course 3\",Général!#REF!,Général!J$78)))","v":0},{"$f":"IF($I$5=\"Course 1\",Général!J$82,IF($I$5=\"Course 2\",Général!J$84,IF($I$5=\"Course 3\",Général!#REF!,Général!J$86)))","v":0},{"$f":"IF($J$5=\"Course 1\",Général!J$90,IF($J$5=\"Course 2\",Général!J$92,IF($J$5=\"Course 3\",Général!#REF!,Général!J$94)))","v":0},{"$f":"IF($K$5=\"Course 1\",Général!J$98,IF($K$5=\"Course 2\",Général!J$100,IF($K$5=\"Course 3\",Général!#REF!,Général!J$102)))","v":0},{"$f":"IF($L$5=\"Course 1\",Général!J$106,IF($L$5=\"Course 2\",Général!J$108,IF($L$5=\"Course 3\",Général!#REF!,Général!J$110)))","v":0},{"$f":"IF($M$5=\"Course 1\",Général!J$114,IF($M$5=\"Course 2\",Général!J$116,IF($M$5=\"Course 3\",Général!#REF!,Général!J$118)))","v":0},{"$f":"IF($N$5=\"Course 1\",Général!J$122,IF($N$5=\"Course 2\",Général!J$124,IF($N$5=\"Course 3\",Général!#REF!,Général!J$126)))","v":0},{"$f":"IF($O$5=\"Course 1\",Général!J$130,IF($O$5=\"Course 2\",Général!J$132,IF($O$5=\"Course 3\",Général!#REF!,Général!J$134)))","v":0},{"$f":"IF($P$5=\"Course 1\",Général!J$138,IF($P$5=\"Course 2\",Général!J$140,IF($P$5=\"Course 3\",Général!#REF!,Général!J$142)))","v":0},{"$f":"IF($Q$5=\"Course 1\",Général!J$146,IF($Q$5=\"Course 2\",Général!J$148,IF($Q$5=\"Course 3\",Général!#REF!,Général!J$150)))","v":0},{"$f":"IF($R$5=\"Course 1\",Général!J$154,IF($R$5=\"Course 2\",Général!J$156,IF($R$5=\"Course 3\",Général!J$158,Général!J$160)))","v":0},null,null,null,{"$f":"Général!B16","v":"Equipage 16"},0]
["10ème Equipage",null,{"$f":"IF($C$5=\"Course 1\",Général!K34,IF($C$5=\"Course 2\",Général!K36,IF($C$5=\"Course 3\",Général!#REF!,Général!K38)))","v":0},{"$f":"IF($D$5=\"Course 1\",Général!K42,IF($D$5=\"Course 2\",Général!K44,IF($D$5=\"Course 3\",Général!#REF!,Général!K46)))","v":0},{"$f":"IF($E$5=\"Course 1\",Général!K50,IF($E$5=\"Course 2\",Général!K52,IF($E$5=\"Course 3\",Général!#REF!,Général!K54)))","v":0},{"$f":"IF($F$5=\"Course 1\",Général!K$58,IF($F$5=\"Course 2\",Général!K$60,IF($F$5=\"Course 3\",Général!#REF!,Général!K$62)))","v":0},{"$f":"IF($G$5=\"Course 1\",Général!K$66,IF($G$5=\"Course 2\",Général!K$68,IF($G$5=\"Course 3\",Général!#REF!,Général!K$70)))","v":0},{"$f":"IF($H$5=\"Course 1\",Général!K$74,IF($H$5=\"Course 2\",Général!K$76,IF($H$5=\"Course 3\",Général!#REF!,Général!K$78)))","v":0},{"$f":"IF($I$5=\"Course 1\",Général!K$82,IF($I$5=\"Course 2\",Général!K$84,IF($I$5=\"Course 3\",Général!#REF!,Général!K$86)))","v":0},{"$f":"IF($J$5=\"Course 1\",Général!K$90,IF($J$5=\"Course 2\",Général!K$92,IF($J$5=\"Course 3\",Général!#REF!,Général!K$94)))","v":0},{"$f":"IF($K$5=\"Course 1\",Général!K$98,IF($K$5=\"Course 2\",Général!K$100,IF($K$5=\"Course 3\",Général!#REF!,Général!K$102)))","v":0},{"$f":"IF($L$5=\"Course 1\",Général!K$106,IF($L$5=\"Course 2\",Général!K$108,IF($L$5=\"Course 3\",Général!#REF!,Général!K$110)))","v":0},{"$f":"IF($M$5=\"Course 1\",Général!K$114,IF($M$5=\"Course 2\",Général!K$116,IF($M$5=\"Course 3\",Général!#REF!,Général!K$118)))","v":0},{"$f":"IF($N$5=\"Course 1\",Général!K$122,IF($N$5=\"Course 2\",Général!K$124,IF($N$5=\"Course 3\",Général!#REF!,Général!K$126)))","v":0},{"$f":"IF($O$5=\"Course 1\",Général!K$130,IF($O$5=\"Course 2\",Général!K$132,IF($O$5=\"Course 3\",Général!#REF!,Général!K$134)))","v":0},{"$f":"IF($P$5=\"Course 1\",Général!K$138,IF($P$5=\"Course 2\",Général!K$140,IF($P$5=\"Course 3\",Général!#REF!,Général!K$142)))","v":0},{"$f":"IF($Q$5=\"Course 1\",Général!K$146,IF($Q$5=\"Course 2\",Général!K$148,IF($Q$5=\"Course 3\",Général!#REF!,Général!K$150)))","v":0},{"$f":"IF($R$5=\"Course 1\",Général!K$154,IF($R$5=\"Course 2\",Général!K$156,IF($R$5=\"Course 3\",Général!K$158,Général!K$160)))","v":0},null,null,null,{"$f":"Général!B17","v":"Equipage 17"},0]
[null,null,null,null,null,null,null,null,null,null,null,null,null,null,null,null,null,null,null,null,null,{"$f":"Général!B18","v":"Equipage 18"},0]
[null,null,null,null,null,null,null,null,null,null,null,null,null,null,null,null,null,null,null,null,null,{"$f":"Général!B19","v":"Equipage 19"},0]
[null,null,null,null,null,null,null,null,null,null,null,null,null,null,null,null,null,null,null,null,null,{"$f":"Général!B20","v":"Equipage 20"},0]
[null,null,null,null,null,null,null,null,null,null,null,null,null,null,null,null,null,null,null,null,null,{"$f":"Général!B21","v":"Equipage 21"},0]
[null,null,null,null,null,null,null,null,null,null,null,null,null,null,null,null,null,null,null,null,null,{"$f":"Général!B22","v":"Equipage 22"},0]
[null,null,null,null,null,null,null,null,null,null,null,null,null,null,null,null,null,null,null,null,null,{"$f":"Général!B23","v":"Equipage 23"},0]
[null,null,null,null,null,null,null,null,null,null,null,null,null,null,null,null,null,null,null,null,null,{"$f":"Général!B24","v":"Equipage 24"},0]
[null,null,null,null,null,null,null,null,null,null,null,null,null,null,null,null,null,null,null,null,null,{"$f":"Général!B25","v":"Equipage 25"},0]
[null,null,null,null,null,null,null,null,null,null,null,null,null,null,null,null,null,null,null,null,null,{"$f":"Général!B26","v":"Equipage 26"},0]
[null,null,null,null,null,null,null,null,null,null,null,null,null,null,null,null,null,null,null,null,null,{"$f":"Général!B27","v":"Equipage 27"},0]
[null,null,null,null,null,null,null,null,null,null,null,null,null,null,null,null,null,null,null,null,null,{"$f":"Général!B28","v":"Equipage 28"},0]
[null,null,null,null,null,null,null,null,null,null,null,null,null,null,null,null,null,null,null,null,null,{"$f":"Général!B29","v":"Equipage 29"},0]
[null,null,null,null,null,null,null,null,null,null,null,null,null,null,null,null,null,null,null,null,null,{"$f":"Général!B30","v":"Equipage 30"},0]

{"sheet":"Eq.2","index":7,"n_rows":29,"n_cols":23,"rows_kept":29,"cut":false,"hidden":true,"merged":[[7,0,7,1],[0,0,1,5],[0,6,1,10],[3,0,3,1],[4,0,4,1],[5,0,5,1],[14,0,14,1],[15,0,15,1],[8,0,8,1],[9,0,9,1],[10,0,10,1],[11,0,11,1],[12,0,12,1],[13,0,13,1]]}
["Equipage ",null,null,null,null,null,{"$f":"Général!B4","v":"Equipage 2"},null,null,null,null,null,null,null,null,null,null,null,null,null,null,{"$f":"Général!B3","v":"Equipage 1"},{"$f":"COUNTIF(C$8:R$16,V1)","v":9}]
[null,null,null,null,null,null,null,null,null,null,null,null,null,null,null,null,null,null,null,null,null,{"$f":"Général!B4","v":"Equipage 2"},{"$f":"COUNTIF($C$8:$R$16,V2)","v":16}]
[null,null,null,null,null,null,null,null,null,null,null,null,null,null,null,null,null,null,null,null,null,{"$f":"Général!B5","v":"Equipage 3"},11]
[null,null,"FLIGHT 1","FLIGHT 2","FLIGHT 3","FLIGHT 4","FLIGHT 5","FLIGHT 6","FLIGHT 7","FLIGHT 8","FLIGHT 9","FLIGHT 10","FLIGHT 11","FLIGHT 12","FLIGHT 13","FLIGHT 14","FLIGHT 15","FLIGHT 16","FLIGHT 17","FLIGHT 18",null,{"$f":"Général!B6","v":"Equipage 4"},3]
["N° de course",null,{"$f":"IF(COUNTIF(Général!B34:K34,$G$1)=1,\"Course 1\",IF(COUNTIF(Général!B36:K36,$G$1)=1,\"Course 2\",IF(COUNTIF(Général!#REF!,$G$1)=1,\"Course 3\",\"Course 4\")))","v":"Course 2"},{"$f":"IF(COUNTIF(Général!B42:K42,$G$1)=1,\"Course 1\",IF(COUNTIF(Général!B44:K44,$G$1)=1,\"Course 2\",IF(COUNTIF(Général!#REF!,$G$1)=1,\"Course 3\",\"Course 4\")))","v":"Course 2"},{"$f":"IF(COUNTIF(Général!B50:K50,$G$1)=1,\"Course 1\",IF(COUNTIF(Général!B52:K52,$G$1)=1,\"Course 2\",IF(COUNTIF(Général!#REF!,$G$1)=1,\"Course 3\",\"Course 4\")))","v":"Course 2"},{"$f":"IF(COUNTIF(Général!B58:K58,$G$1)=1,\"Course 1\",IF(COUNTIF(Général!B60:K60,$G$1)=1,\"Course 2\",IF(COUNTIF(Général!#REF!,$G$1)=1,\"Course 3\",\"Course 4\")))","v":"Course 2"},{"$f":"IF(COUNTIF(Général!B66:K66,$G$1)=1,\"Course 1\",IF(COUNTIF(Général!B68:K68,$G$1)=1,\"Course 2\",IF(COUNTIF(Général!#REF!,$G$1)=1,\"Course 3\",\"Course 4\")))","v":"Course 1"},{"$f":"IF(COUNTIF(Général!B74:K74,$G$1)=1,\"Course 1\",IF(COUNTIF(Général!B76:K76,$G$1)=1,\"Course 2\",IF(COUNTIF(Général!#REF!,$G$1)=1,\"Course 3\",\"Course 4\")))","v":"Course 1"},{"$f":"IF(COUNTIF(Général!B82:K82,$G$1)=1,\"Course 1\",IF(COUNTIF(Général!B84:K84,$G$1)=1,\"Course 2\",IF(COUNTIF(Général!#REF!,$G$1)=1,\"Course 3\",\"Course 4\")))","v":"Course 2"},{"$f":"IF(COUNTIF(Général!B90:K90,$G$1)=1,\"Course 1\",IF(COUNTIF(Général!B92:K92,$G$1)=1,\"Course 2\",IF(COUNTIF(Général!#REF!,$G$1)=1,\"Course 3\",\"Course 4\")))","v":"Course 2"},{"$f":"IF(COUNTIF(Général!B98:K98,$G$1)=1,\"Course 1\",IF(COUNTIF(Général!B100:K100,$G$1)=1,\"Course 2\",IF(COUNTIF(Général!#REF!,$G$1)=1,\"Course 3\",\"Course 4\")))","v":"Course 1"},{"$f":"IF(COUNTIF(Général!B106:K106,$G$1)=1,\"Course 1\",IF(COUNTIF(Général!B108:K108,$G$1)=1,\"Course 2\",IF(COUNTIF(Général!#REF!,$G$1)=1,\"Course 3\",\"Course 4\")))","v":"Course 1"},{"$f":"IF(COUNTIF(Général!B114:K114,$G$1)=1,\"Course 1\",IF(COUNTIF(Général!B116:K116,$G$1)=1,\"Course 2\",IF(COUNTIF(Général!#REF!,$G$1)=1,\"Course 3\",\"Course 4\")))","v":"Course 1"},{"$f":"IF(COUNTIF(Général!B122:K122,$G$1)=1,\"Course 1\",IF(COUNTIF(Général!B124:K124,$G$1)=1,\"Course 2\",IF(COUNTIF(Général!#REF!,$G$1)=1,\"Course 3\",\"Course 4\")))","v":"Course 1"},{"$f":"IF(COUNTIF(Général!B130:K130,$G$1)=1,\"Course 1\",IF(COUNTIF(Général!B132:K132,$G$1)=1,\"Course 2\",IF(COUNTIF(Général!#REF!,$G$1)=1,\"Course 3\",\"Course 4\")))","v":"Course 1"},{"$f":"IF(COUNTIF(Général!B138:K138,$G$1)=1,\"Course 1\",IF(COUNTIF(Général!B140:K140,$G$1)=1,\"Course 2\",IF(COUNTIF(Général!#REF!,$G$1)=1,\"Course 3\",\"Course 4\")))","v":"Course 1"},{"$f":"IF(COUNTIF(Général!B146:K146,$G$1)=1,\"Course 1\",IF(COUNTIF(Général!B148:K148,$G$1)=1,\"Course 2\",IF(COUNTIF(Général!#REF!,$G$1)=1,\"Course 3\",\"Course 4\")))","v":"Course 1"},{"$f":"IF(COUNTIF(Général!B154:K154,$G$1)=1,\"Course 1\",IF(COUNTIF(Général!B156:K156,$G$1)=1,\"Course 2\",IF(COUNTIF(Général!B158:K158,$G$1)=1,\"Course 3\",\"Course 4\")))","v":"Course 2"},{"$f":"IF(COUNTIF(Général!C154:L154,$G$1)=1,\"Course 1\",IF(COUNTIF(Général!C156:L156,$G$1)=1,\"Course 2\",IF(COUNTIF(Général!C158:L158,$G$1)=1,\"Course 3\",\"Course 4\")))","v":"Course 2"},{"$f":"IF(COUNTIF(Général!D154:M154,$G$1)=1,\"Course 1\",IF(COUNTIF(Général!D156:M156,$G$1)=1,\"Course 2\",IF(COUNTIF(Général!D158:M158,$G$1)=1,\"Course 3\",\"Course 4\")))","v":"Course 2"},null,{"$f":"Général!B7","v":"Equipage 5"},8]
["Bateau",null,{"$f":"IF(COUNTIF(Général!B34:B38,$G$1)=1,\"Boat 1\",IF(COUNTIF(Général!C34:C38,$G$1)=1,\"Boat 2\",IF(COUNTIF(Général!D34:D38,$G$1)=1,\"Boat 3\",IF(COUNTIF(Général!E34:E38,$G$1)=1,\"Boat 4\",IF(COUNTIF(Général!F34:F38,$G$1)=1,\"Boat 5\",IF(COUNTIF(Général!G34:G38,$G$1)=1,\"Boat 6\",IF(COUNTIF(Général!H34:H38,$G$1)=1,\"Boat 7\",IF(COUNTIF(Général!I34:I38,$G$1)=1,\"Boat 8\",IF(COUNTIF(Général!J34:J38,$G$1)=1,\"Boat 9\",\"Boat10\")))))))))","v":"Boat 5"},{"$f":"IF(COUNTIF(Général!B42:B46,$G$1)=1,\"Boat 1\",IF(COUNTIF(Général!C42:C46,$G$1)=1,\"Boat 2\",IF(COUNTIF(Général!D42:D46,$G$1)=1,\"Boat 3\",IF(COUNTIF(Général!E42:E46,$G$1)=1,\"Boat 4\",IF(COUNTIF(Général!F42:F46,$G$1)=1,\"Boat 5\",IF(COUNTIF(Général!G42:G46,$G$1)=1,\"Boat 6\",IF(COUNTIF(Général!H42:H46,$G$1)=1,\"Boat 7\",IF(COUNTIF(Général!I42:I46,$G$1)=1,\"Boat 8\",IF(COUNTIF(Général!J42:J46,$G$1)=1,\"Boat 9\",\"Boat 10\")))))))))","v":"Boat 2"},{"$f":"IF(COUNTIF(Général!B50:B54,$G$1)=1,\"Boat 1\",IF(COUNTIF(Général!C50:C54,$G$1)=1,\"Boat 2\",IF(COUNTIF(Général!D50:D54,$G$1)=1,\"Boat 3\", IF(COUNTIF(Général!E50:E54,$G$1)=1,\"Boat 4\", IF(COUNTIF(Général!F50:F54,$G$1)=1,\"Boat 5\", IF(COUNTIF(Général!G50:G54,$G$1)=1,\"Boat 6\", IF(COUNTIF(Général!H50:H54,$G$1)=1,\"Boat 7\",IF(COUNTIF(Général!I50:I54,$G$1)=1,\"Boat 8\",IF(COUNTIF(Général!J50:J54,$G$1)=1,\"Boat 9\",\"Boat 10\")))))))))","v":"Boat 2"},{"$f":"IF(COUNTIF(Général!B58:B62,$G$1)=1,\"Boat 1\",IF(COUNTIF(Général!C58:C62,$G$1)=1,\"Boat 2\",IF(COUNTIF(Général!D58:D62,$G$1)=1,\"Boat 3\", IF(COUNTIF(Général!E58:E62,$G$1)=1,\"Boat 4\", IF(COUNTIF(Général!F58:F62,$G$1)=1,\"Boat 5\", IF(COUNTIF(Général!G58:G62,$G$1)=1,\"Boat 6\", IF(COUNTIF(Général!H58:H62,$G$1)=1,\"Boat 7\",IF(COUNTIF(Général!I58:I62,$G$1)=1,\"Boat 8\",IF(COUNTIF(Général!I58:J62,$G$1)=1,\"Boat 9\",\"Boat 10\")))))))))","v":"Boat 1"},{"$f":"IF(COUNTIF(Général!B66:B70,$G$1)=1,\"Boat 1\",IF(COUNTIF(Général!C66:C70,$G$1)=1,\"Boat 2\",IF(COUNTIF(Général!D66:D70,$G$1)=1,\"Boat 3\", IF(COUNTIF(Général!E66:E70,$G$1)=1,\"Boat 4\", IF(COUNTIF(Général!F66:F70,$G$1)=1,\"Boat 5\", IF(COUNTIF(Général!G66:G70,$G$1)=1,\"Boat 6\", IF(COUNTIF(Général!H66:H70,$G$1)=1,\"Boat 7\",IF(COUNTIF(Général!I66:I70,$G$1)=1,\"Boat 8\",IF(COUNTIF(Général!J66:J70,$G$1)=1,\"Boat 9\",\"Boat 10\")))))))))","v":"Boat 1"},{"$f":"IF(COUNTIF(Général!B74:B78,$G$1)=1,\"Boat 1\",IF(COUNTIF(Général!C74:C78,$G$1)=1,\"Boat 2\",IF(COUNTIF(Général!D74:D78,$G$1)=1,\"Boat 3\", IF(COUNTIF(Général!E74:E78,$G$1)=1,\"Boat 4\", IF(COUNTIF(Général!F74:F78,$G$1)=1,\"Boat 5\", IF(COUNTIF(Général!G74:G78,$G$1)=1,\"Boat 6\", IF(COUNTIF(Général!H74:H78,$G$1)=1,\"Boat 7\",IF(COUNTIF(Général!I74:I78,$G$1)=1,\"Boat 8\",IF(COUNTIF(Général!J74:J78,$G$1)=1,\"Boat 9\",\"Boat 10\")))))))))","v":"Boat 3"},{"$f":"IF(COUNTIF(Général!B82:B86,$G$1)=1,\"Boat 1\",IF(COUNTIF(Général!C82:C86,$G$1)=1,\"Boat 2\",IF(COUNTIF(Général!D82:D86,$G$1)=1,\"Boat 3\", IF(COUNTIF(Général!E82:E86,$G$1)=1,\"Boat 4\", IF(COUNTIF(Général!F82:F86,$G$1)=1,\"Boat 5\", IF(COUNTIF(Général!G82:G86,$G$1)=1,\"Boat 6\", IF(COUNTIF(Général!H82:H86,$G$1)=1,\"Boat 7\",IF(COUNTIF(Général!I82:I86,$G$1)=1,\"Boat 8\",IF(COUNTIF(Général!J82:J86,$G$1)=1,\"Boat 9\",\"Boat 10\")))))))))","v":"Boat 5"},{"$f":"IF(COUNTIF(Général!B90:B94,$G$1)=1,\"Boat 1\",IF(COUNTIF(Général!C90:C94,$G$1)=1,\"Boat 2\",IF(COUNTIF(Général!D90:D94,$G$1)=1,\"Boat 3\", IF(COUNTIF(Général!E90:E94,$G$1)=1,\"Boat 4\", IF(COUNTIF(Général!F90:F94,$G$1)=1,\"Boat 5\", IF(COUNTIF(Général!G90:G94,$G$1)=1,\"Boat 6\", IF(COUNTIF(Général!H90:H94,$G$1)=1,\"Boat 7\",IF(COUNTIF(Général!I90:I94,$G$1)=1,\"Boat 8\",IF(COUNTIF(Général!J90:J94,$G$1)=1,\"Boat 9\",\"Boat 10\")))))))))","v":"Boat 4"},{"$f":"IF(COUNTIF(Général!B98:B102,$G$1)=1,\"Boat 1\",IF(COUNTIF(Général!C98:C102,$G$1)=1,\"Boat 2\",IF(COUNTIF(Général!D98:D102,$G$1)=1,\"Boat 3\", IF(COUNTIF(Général!E98:E102,$G$1)=1,\"Boat 4\", IF(COUNTIF(Général!F98:F102,$G$1)=1,\"Boat 5\", IF(COUNTIF(Général!G98:G102,$G$1)=1,\"Boat 6\", IF(COUNTIF(Général!H98:H102,$G$1)=1,\"Boat 7\",IF(COUNTIF(Général!I98:I102,$G$1)=1,\"Boat 8\",IF(COUNTIF(Général!J98:J102,$G$1)=1,\"Boat 9\",\"Boat 10\")))))))))","v":"Boat 4"},{"$f":"IF(COUNTIF(Général!B106:B110,$G$1)=1,\"Boat 1\",IF(COUNTIF(Général!C106:C110,$G$1)=1,\"Boat 2\",IF(COUNTIF(Général!D106:D110,$G$1)=1,\"Boat 3\", IF(COUNTIF(Général!E106:E110,$G$1)=1,\"Boat 4\", IF(COUNTIF(Général!F106:F110,$G$1)=1,\"Boat 5\", IF(COUNTIF(Général!G106:G110,$G$1)=1,\"Boat 6\", IF(COUNTIF(Général!H106:H110,$G$1)=1,\"Boat 7\",IF(COUNTIF(Général!I106:I110,$G$1)=1,\"Boat 8\",IF(COUNTIF(Général!J106:J110,$G$1)=1,\"Boat 9\",\"Boat 10\")))))))))","v":"Boat 5"},{"$f":"IF(COUNTIF(Général!B114:B118,$G$1)=1,\"Boat 1\",IF(COUNTIF(Général!C114:C118,$G$1)=1,\"Boat 2\",IF(COUNTIF(Général!C114:D118,$G$1)=1,\"Boat 3\", IF(COUNTIF(Général!C114:E118,$G$1)=1,\"Boat 4\", IF(COUNTIF(Général!F114:F118,$G$1)=1,\"Boat 5\", IF(COUNTIF(Général!G114:G118,$G$1)=1,\"Boat 6\", IF(COUNTIF(Général!H114:H118,$G$1)=1,\"Boat 7\",IF(COUNTIF(Général!I114:I118,$G$1)=1,\"Boat 8\",IF(COUNTIF(Général!J114:J118,$G$1)=1,\"Boat 9\",\"Boat 10\")))))))))","v":"Boat 2"},{"$f":"IF(COUNTIF(Général!B122:B126,$G$1)=1,\"Boat 1\",IF(COUNTIF(Général!C122:C126,$G$1)=1,\"Boat 2\",IF(COUNTIF(Général!D122:D126,$G$1)=1,\"Boat 3\", IF(COUNTIF(Général!E122:E126,$G$1)=1,\"Boat 4\", IF(COUNTIF(Général!F122:F126,$G$1)=1,\"Boat 5\", IF(COUNTIF(Général!G122:G126,$G$1)=1,\"Boat 6\", IF(COUNTIF(Général!H122:H126,$G$1)=1,\"Boat 7\",IF(COUNTIF(Général!I122:I126,$G$1)=1,\"Boat 8\",IF(COUNTIF(Général!J122:J126,$G$1)=1,\"Boat 9\",\"Boat 10\")))))))))","v":"Boat 4"},{"$f":"IF(COUNTIF(Général!B130:B134,$G$1)=1,\"Boat 1\",IF(COUNTIF(Général!C130:C134,$G$1)=1,\"Boat 2\",IF(COUNTIF(Général!D130:D134,$G$1)=1,\"Boat 3\", IF(COUNTIF(Général!E130:E134,$G$1)=1,\"Boat 4\", IF(COUNTIF(Général!F130:F134,$G$1)=1,\"Boat 5\", IF(COUNTIF(Général!G130:G134,$G$1)=1,\"Boat 6\", IF(COUNTIF(Général!H130:H134,$G$1)=1,\"Boat 7\",IF(COUNTIF(Général!I130:I134,$G$1)=1,\"Boat 8\",IF(COUNTIF(Général!J130:J134,$G$1)=1,\"Boat 9\",\"Boat 10\")))))))))","v":"Boat 3"},{"$f":"IF(COUNTIF(Général!B138:B142,$G$1)=1,\"Boat 1\",IF(COUNTIF(Général!C138:C142,$G$1)=1,\"Boat 2\",IF(COUNTIF(Général!D138:D142,$G$1)=1,\"Boat 3\", IF(COUNTIF(Général!E138:E142,$G$1)=1,\"Boat 4\", IF(COUNTIF(Général!F138:F142,$G$1)=1,\"Boat 5\", IF(COUNTIF(Général!G138:G142,$G$1)=1,\"Boat 6\", IF(COUNTIF(Général!H138:H142,$G$1)=1,\"Boat 7\",IF(COUNTIF(Général!I138:I142,$G$1)=1,\"Boat 8\",IF(COUNTIF(Général!J138:J142,$G$1)=1,\"Boat 9\",\"Boat 10\")))))))))","v":"Boat 2"},{"$f":"IF(COUNTIF(Général!B146:B150,$G$1)=1,\"Boat 1\",IF(COUNTIF(Général!C146:C150,$G$1)=1,\"Boat 2\",IF(COUNTIF(Général!D146:D150,$G$1)=1,\"Boat 3\", IF(COUNTIF(Général!E146:E150,$G$1)=1,\"Boat 4\", IF(COUNTIF(Général!F146:F150,$G$1)=1,\"Boat 5\", IF(COUNTIF(Général!G146:G150,$G$1)=1,\"Boat 6\", IF(COUNTIF(Général!H146:H150,$G$1)=1,\"Boat 7\",IF(COUNTIF(Général!I146:I150,$G$1)=1,\"Boat 8\",IF(COUNTIF(Général!J146:J150,$G$1)=1,\"Boat 9\",\"Boat 10\")))))))))","v":"Boat 3"},{"$f":"IF(COUNTIF(Général!B154:B157,$G$1)=1,\"Boat 1\",IF(COUNTIF(Général!C154:C157,$G$1)=1,\"Boat 2\",IF(COUNTIF(Général!D154:D157,$G$1)=1,\"Boat 3\", IF(COUNTIF(Général!E154:E157,$G$1)=1,\"Boat 4\", IF(COUNTIF(Général!F154:F157,$G$1)=1,\"Boat 5\", IF(COUNTIF(Général!G154:G157,$G$1)=1,\"Boat 6\", IF(COUNTIF(Général!H154:H157,$G$1)=1,\"Boat 7\",IF(COUNTIF(Général!I154:I157,$G$1)=1,\"Boat 8\",IF(COUNTIF(Général!J154:J157,$G$1)=1,\"Boat 9\",\"Boat 10\")))))))))","v":"Boat 3"},{"$f":"IF(COUNTIF(Général!B160:B163,$G$1)=1,\"Boat 1\",IF(COUNTIF(Général!C160:C163,$G$1)=1,\"Boat 2\",IF(COUNTIF(Général!D160:D163,$G$1)=1,\"Boat 3\", IF(COUNTIF(Général!E160:E163,$G$1)=1,\"Boat 4\", IF(COUNTIF(Général!F160:F163,$G$1)=1,\"Boat 5\", IF(COUNTIF(Général!G160:G163,$G$1)=1,\"Boat 6\", IF(COUNTIF(Général!H160:H163,$G$1)=1,\"Boat 7\",IF(COUNTIF(Général!I160:I163,$G$1)=1,\"Boat 8\",IF(COUNTIF(Général!J160:J163,$G$1)=1,\"Boat 9\",\"Boat 10\")))))))))","v":"Boat 3"},{"$f":"IF(COUNTIF(Général!B166:B169,$G$1)=1,\"Boat 1\",IF(COUNTIF(Général!C166:C169,$G$1)=1,\"Boat 2\",IF(COUNTIF(Général!D166:D169,$G$1)=1,\"Boat 3\", IF(COUNTIF(Général!E166:E169,$G$1)=1,\"Boat 4\", IF(COUNTIF(Général!F166:F169,$G$1)=1,\"Boat 5\", IF(COUNTIF(Général!G166:G169,$G$1)=1,\"Boat 6\", IF(COUNTIF(Général!H166:H169,$G$1)=1,\"Boat 7\",IF(COUNTIF(Général!I166:I169,$G$1)=1,\"Boat 8\",IF(COUNTIF(Général!J166:J169,$G$1)=1,\"Boat 9\",\"Boat 10\")))))))))","v":"Boat 3"},null,{"$f":"Général!B8","v":"Equipage 6"},9]
[null,null,null,null,null,null,null,null,null,null,null,null,null,null,null,null,null,null,null,null,null,{"$f":"Général!B9","v":"Equipage 7"},4]
["1er Equipage",null,{"$f":"IF($C$5=\"Course 1\",Général!B34,IF($C$5=\"Course 2\",Général!B36,IF($C$5=\"Course 3\",Général!#REF!,Général!B38)))","v":"Equipage 8"},{"$f":"IF($D$5=\"Course 1\",Général!B42,IF($D$5=\"Course 2\",Général!B44,IF($D$5=\"Course 3\",Général!#REF!,Général!B46)))","v":"Equipage 5"},{"$f":"IF($E$5=\"Course 1\",Général!B50,IF($E$5=\"Course 2\",Général!B52,IF($E$5=\"Course 3\",Général!#REF!,Général!B54)))","v":"Equipage 1"},{"$f":"IF($F$5=\"Course 1\",Général!B$58,IF($F$5=\"Course 2\",Général!B$60,IF($F$5=\"Course 3\",Général!#REF!,Général!B$62)))","v":"Equipage 2"},{"$f":"IF($G$5=\"Course 1\",Général!B$66,IF($G$5=\"Course 2\",Général!B$68,IF($G$5=\"Course 3\",Général!#REF!,Général!B$70)))","v":"Equipage 2"},{"$f":"IF($H$5=\"Course 1\",Général!B$74,IF($H$5=\"Course 2\",Général!B$76,IF($H$5=\"Course 3\",Général!#REF!,Général!B$78)))","v":"Equipage 3"},{"$f":"IF($I$5=\"Course 1\",Général!B$82,IF($I$5=\"Course 2\",Général!B$84,IF($I$5=\"Course 3\",Général!#REF!,Général!B$86)))","v":"Equipage 6"},{"$f":"IF($J$5=\"Course 1\",Général!B$90,IF($J$5=\"Course 2\",Général!B$92,IF($J$5=\"Course 3\",Général!#REF!,Général!B$94)))","v":"Equipage 10"},{"$f":"IF($K$5=\"Course 1\",Général!B$98,IF($K$5=\"Course 2\",Général!B$100,IF($K$5=\"Course 3\",Général!#REF!,Général!B$102)))","v":"Equipage 6"},{"$f":"IF($L$5=\"Course 1\",Général!B$106,IF($L$5=\"Course 2\",Général!B$108,IF($L$5=\"Course 3\",Général!#REF!,Général!B$110)))","v":"Equipage 3"},{"$f":"IF($M$5=\"Course 1\",Général!B$114,IF($M$5=\"Course 2\",Général!B$116,IF($M$5=\"Course 3\",Général!#REF!,Général!B$118)))","v":"Equipage 5"},{"$f":"IF($N$5=\"Course 1\",Général!B$122,IF($N$5=\"Course 2\",Général!B$124,IF($N$5=\"Course 3\",Général!#REF!,Général!B$126)))","v":"Equipage 9"},{"$f":"IF($O$5=\"Course 1\",Général!B$130,IF($O$5=\"Course 2\",Général!B$132,IF($O$5=\"Course 3\",Général!#REF!,Général!B$134)))","v":"Equipage 8"},{"$f":"IF($P$5=\"Course 1\",Général!B$138,IF($P$5=\"Course 2\",Général!B$140,IF($P$5=\"Course 3\",Général!#REF!,Général!B$142)))","v":"Equipage 9"},{"$f":"IF($Q$5=\"Course 1\",Général!B$146,IF($Q$5=\"Course 2\",Général!B$148,IF($Q$5=\"Course 3\",Général!#REF!,Général!B$150)))","v":"Equipage 8"},{"$f":"IF($R$5=\"Course 1\",Général!B$154,IF($R$5=\"Course 2\",Général!B$156,IF($R$5=\"Course 3\",Général!B$158,Général!B$160)))","v":"Equipage 3"},null,null,null,{"$f":"Général!B10","v":"Equipage 8"},8]
["2nd Equipage",null,{"$f":"IF($C$5=\"Course 1\",Général!C34,IF($C$5=\"Course 2\",Général!C36,IF($C$5=\"Course 3\",Général!#REF!,Général!C38)))","v":"Equipage 5"},{"$f":"IF($D$5=\"Course 1\",Général!C42,IF($D$5=\"Course 2\",Général!C44,IF($D$5=\"Course 3\",Général!#REF!,Général!C46)))","v":"Equipage 2"},{"$f":"IF($E$5=\"Course 1\",Général!C50,IF($E$5=\"Course 2\",Général!C52,IF($E$5=\"Course 3\",Général!#REF!,Général!C54)))","v":"Equipage 2"},{"$f":"IF($F$5=\"Course 1\",Général!C$58,IF($F$5=\"Course 2\",Général!C$60,IF($F$5=\"Course 3\",Général!#REF!,Général!C$62)))","v":"Equipage 4"},{"$f":"IF($G$5=\"Course 1\",Général!C$66,IF($G$5=\"Course 2\",Général!C$68,IF($G$5=\"Course 3\",Général!#REF!,Général!C$70)))","v":"Equipage 3"},{"$f":"IF($H$5=\"Course 1\",Général!C$74,IF($H$5=\"Course 2\",Général!C$76,IF($H$5=\"Course 3\",Général!#REF!,Général!C$78)))","v":"Equipage 7"},{"$f":"IF($I$5=\"Course 1\",Général!C$82,IF($I$5=\"Course 2\",Général!C$84,IF($I$5=\"Course 3\",Général!#REF!,Général!C$86)))","v":"Equipage 9"},{"$f":"IF($J$5=\"Course 1\",Général!C$90,IF($J$5=\"Course 2\",Général!C$92,IF($J$5=\"Course 3\",Général!#REF!,Général!C$94)))","v":"Equipage 1"},{"$f":"IF($K$5=\"Course 1\",Général!C$98,IF($K$5=\"Course 2\",Général!C$100,IF($K$5=\"Course 3\",Général!#REF!,Général!C$102)))","v":"Equipage 1"},{"$f":"IF($L$5=\"Course 1\",Général!C$106,IF($L$5=\"Course 2\",Général!C$108,IF($L$5=\"Course 3\",Général!#REF!,Général!C$110)))","v":"Equipage 6"},{"$f":"IF($M$5=\"Course 1\",Général!C$114,IF($M$5=\"Course 2\",Général!C$116,IF($M$5=\"Course 3\",Général!#REF!,Général!C$118)))","v":"Equipage 2"},{"$f":"IF($N$5=\"Course 1\",Général!C$122,IF($N$5=\"Course 2\",Général!C$124,IF($N$5=\"Course 3\",Général!#REF!,Général!C$126)))","v":"Equipage 6"},{"$f":"IF($O$5=\"Course 1\",Général!C$130,IF($O$5=\"Course 2\",Général!C$132,IF($O$5=\"Course 3\",Général!#REF!,Général!C$134)))","v":"Equipage 3"},{"$f":"IF($P$5=\"Course 1\",Général!C$138,IF($P$5=\"Course 2\",Général!C$140,IF($P$5=\"Course 3\",Général!#REF!,Général!C$142)))","v":"Equipage 2"},{"$f":"IF($Q$5=\"Course 1\",Général!C$146,IF($Q$5=\"Course 2\",Général!C$148,IF($Q$5=\"Course 3\",Général!#REF!,Général!C$150)))","v":"Equipage 1"},{"$f":"IF($R$5=\"Course 1\",Général!C$154,IF($R$5=\"Course 2\",Général!C$156,IF($R$5=\"Course 3\",Général!C$158,Général!C$160)))","v":"Equipage 9"},null,null,null,{"$f":"Général!B11","v":"Equipage 9"},10]
["3ème Equipage",null,{"$f":"IF($C$5=\"Course 1\",Général!D34,IF($C$5=\"Course 2\",Général!D36,IF($C$5=\"Course 3\",Général!#REF!,Général!D38)))","v":"Equipage 9"},{"$f":"IF($D$5=\"Course 1\",Général!D42,IF($D$5=\"Course 2\",Général!D44,IF($D$5=\"Course 3\",Général!#REF!,Général!D46)))","v":"Equipage 3"},{"$f":"IF($E$5=\"Course 1\",Général!D50,IF($E$5=\"Course 2\",Général!D52,IF($E$5=\"Course 3\",Général!#REF!,Général!D54)))","v":"Equipage 3"},{"$f":"IF($F$5=\"Course 1\",Général!D$58,IF($F$5=\"Course 2\",Général!D$60,IF($F$5=\"Course 3\",Général!#REF!,Général!D$62)))","v":"Equipage 8"},{"$f":"IF($G$5=\"Course 1\",Général!D$66,IF($G$5=\"Course 2\",Général!D$68,IF($G$5=\"Course 3\",Général!#REF!,Général!D$70)))","v":"Equipage 6"},{"$f":"IF($H$5=\"Course 1\",Général!D$74,IF($H$5=\"Course 2\",Général!D$76,IF($H$5=\"Course 3\",Général!#REF!,Général!D$78)))","v":"Equipage 2"},{"$f":"IF($I$5=\"Course 1\",Général!D$82,IF($I$5=\"Course 2\",Général!D$84,IF($I$5=\"Course 3\",Général!#REF!,Général!D$86)))","v":"Equipage 1"},{"$f":"IF($J$5=\"Course 1\",Général!D$90,IF($J$5=\"Course 2\",Général!D$92,IF($J$5=\"Course 3\",Général!#REF!,Général!D$94)))","v":"Equipage 3"},{"$f":"IF($K$5=\"Course 1\",Général!D$98,IF($K$5=\"Course 2\",Général!D$100,IF($K$5=\"Course 3\",Général!#REF!,Général!D$102)))","v":"Equipage 9"},{"$f":"IF($L$5=\"Course 1\",Général!D$106,IF($L$5=\"Course 2\",Général!D$108,IF($L$5=\"Course 3\",Général!#REF!,Général!D$110)))","v":"Equipage 5"},{"$f":"IF($M$5=\"Course 1\",Général!D$114,IF($M$5=\"Course 2\",Général!D$116,IF($M$5=\"Course 3\",Général!#REF!,Général!D$118)))","v":"Equipage 6"},{"$f":"IF($N$5=\"Course 1\",Général!D$122,IF($N$5=\"Course 2\",Général!D$124,IF($N$5=\"Course 3\",Général!#REF!,Général!D$126)))","v":"Equipage 10"},{"$f":"IF($O$5=\"Course 1\",Général!D$130,IF($O$5=\"Course 2\",Général!D$132,IF($O$5=\"Course 3\",Général!#REF!,Général!D$134)))","v":"Equipage 2"},{"$f":"IF($P$5=\"Course 1\",Général!D$138,IF($P$5=\"Course 2\",Général!D$140,IF($P$5=\"Course 3\",Général!#REF!,Général!D$142)))","v":"Equipage 6"},{"$f":"IF($Q$5=\"Course 1\",Général!D$146,IF($Q$5=\"Course 2\",Général!D$148,IF($Q$5=\"Course 3\",Général!#REF!,Général!D$150)))","v":"Equipage 2"},{"$f":"IF($R$5=\"Course 1\",Général!D$154,IF($R$5=\"Course 2\",Général!D$156,IF($R$5=\"Course 3\",Général!D$158,Général!D$160)))","v":"Equipage 2"},null,null,null,{"$f":"Général!B12","v":"Equipage 10"},2]
["4ème Equipage",null,{"$f":"IF($C$5=\"Course 1\",Général!E34,IF($C$5=\"Course 2\",Général!E36,IF($C$5=\"Course 3\",Général!#REF!,Général!E38)))","v":"Equipage 3"},{"$f":"IF($D$5=\"Course 1\",Général!E42,IF($D$5=\"Course 2\",Général!E44,IF($D$5=\"Course 3\",Général!#REF!,Général!E46)))","v":"Equipage 1"},{"$f":"IF($E$5=\"Course 1\",Général!E50,IF($E$5=\"Course 2\",Général!E52,IF($E$5=\"Course 3\",Général!#REF!,Général!E54)))","v":"Equipage 9"},{"$f":"IF($F$5=\"Course 1\",Général!E$58,IF($F$5=\"Course 2\",Général!E$60,IF($F$5=\"Course 3\",Général!#REF!,Général!E$62)))","v":"Equipage 5"},{"$f":"IF($G$5=\"Course 1\",Général!E$66,IF($G$5=\"Course 2\",Général!E$68,IF($G$5=\"Course 3\",Général!#REF!,Général!E$70)))","v":"Equipage 9"},{"$f":"IF($H$5=\"Course 1\",Général!E$74,IF($H$5=\"Course 2\",Général!E$76,IF($H$5=\"Course 3\",Général!#REF!,Général!E$78)))","v":"Equipage 6"},{"$f":"IF($I$5=\"Course 1\",Général!E$82,IF($I$5=\"Course 2\",Général!E$84,IF($I$5=\"Course 3\",Général!#REF!,Général!E$86)))","v":"Equipage 3"},{"$f":"IF($J$5=\"Course 1\",Général!E$90,IF($J$5=\"Course 2\",Général!E$92,IF($J$5=\"Course 3\",Général!#REF!,Général!E$94)))","v":"Equipage 2"},{"$f":"IF($K$5=\"Course 1\",Général!E$98,IF($K$5=\"Course 2\",Général!E$100,IF($K$5=\"Course 3\",Général!#REF!,Général!E$102)))","v":"Equipage 2"},{"$f":"IF($L$5=\"Course 1\",Général!E$106,IF($L$5=\"Course 2\",Général!E$108,IF($L$5=\"Course 3\",Général!#REF!,Général!E$110)))","v":"Equipage 7"},{"$f":"IF($M$5=\"Course 1\",Général!E$114,IF($M$5=\"Course 2\",Général!E$116,IF($M$5=\"Course 3\",Général!#REF!,Général!E$118)))","v":"Equipage 8"},{"$f":"IF($N$5=\"Course 1\",Général!E$122,IF($N$5=\"Course 2\",Général!E$124,IF($N$5=\"Course 3\",Général!#REF!,Général!E$126)))","v":"Equipage 2"},{"$f":"IF($O$5=\"Course 1\",Général!E$130,IF($O$5=\"Course 2\",Général!E$132,IF($O$5=\"Course 3\",Général!#REF!,Général!E$134)))","v":"Equipage 1"},{"$f":"IF($P$5=\"Course 1\",Général!E$138,IF($P$5=\"Course 2\",Général!E$140,IF($P$5=\"Course 3\",Général!#REF!,Général!E$142)))","v":"Equipage 5"},{"$f":"IF($Q$5=\"Course 1\",Général!E$146,IF($Q$5=\"Course 2\",Général!E$148,IF($Q$5=\"Course 3\",Général!#REF!,Général!E$150)))","v":"Equipage 4"},{"$f":"IF($R$5=\"Course 1\",Général!E$154,IF($R$5=\"Course 2\",Général!E$156,IF($R$5=\"Course 3\",Général!E$158,Général!E$160)))","v":"Equipage 5"}]
["5ème Equipage",null,{"$f":"IF($C$5=\"Course 1\",Général!F34,IF($C$5=\"Course 2\",Général!F36,IF($C$5=\"Course 3\",Général!#REF!,Général!F38)))","v":"Equipage 2"},{"$f":"IF($D$5=\"Course 1\",Général!F42,IF($D$5=\"Course 2\",Général!F44,IF($D$5=\"Course 3\",Général!#REF!,Général!F46)))","v":"Equipage 7"},{"$f":"IF($E$5=\"Course 1\",Général!F50,IF($E$5=\"Course 2\",Général!F52,IF($E$5=\"Course 3\",Général!#REF!,Général!F54)))","v":"Equipage 6"},{"$f":"IF($F$5=\"Course 1\",Général!F$58,IF($F$5=\"Course 2\",Général!F$60,IF($F$5=\"Course 3\",Général!#REF!,Général!F$62)))","v":"Equipage 1"},{"$f":"IF($G$5=\"Course 1\",Général!F$66,IF($G$5=\"Course 2\",Général!F$68,IF($G$5=\"Course 3\",Général!#REF!,Général!F$70)))","v":"Equipage 7"},{"$f":"IF($H$5=\"Course 1\",Général!F$74,IF($H$5=\"Course 2\",Général!F$76,IF($H$5=\"Course 3\",Général!#REF!,Général!F$78)))","v":"Equipage 1"},{"$f":"IF($I$5=\"Course 1\",Général!F$82,IF($I$5=\"Course 2\",Général!F$84,IF($I$5=\"Course 3\",Général!#REF!,Général!F$86)))","v":"Equipage 2"},{"$f":"IF($J$5=\"Course 1\",Général!F$90,IF($J$5=\"Course 2\",Général!F$92,IF($J$5=\"Course 3\",Général!#REF!,Général!F$94)))","v":"Equipage 8"},{"$f":"IF($K$5=\"Course 1\",Général!F$98,IF($K$5=\"Course 2\",Général!F$100,IF($K$5=\"Course 3\",Général!#REF!,Général!F$102)))","v":"Equipage 4"},{"$f":"IF($L$5=\"Course 1\",Général!F$106,IF($L$5=\"Course 2\",Général!$F108,IF($L$5=\"Course 3\",Général!#REF!,Général!F$110)))","v":"Equipage 2"},{"$f":"IF($M$5=\"Course 1\",Général!F$114,IF($M$5=\"Course 2\",Général!F$116,IF($M$5=\"Course 3\",Général!#REF!,Général!F$118)))","v":"Equipage 9"},{"$f":"IF($N$5=\"Course 1\",Général!F$122,IF($N$5=\"Course 2\",Général!F$124,IF($N$5=\"Course 3\",Général!#REF!,Général!F$126)))","v":"Equipage 3"},{"$f":"IF($O$5=\"Course 1\",Général!F$130,IF($O$5=\"Course 2\",Général!F$132,IF($O$5=\"Course 3\",Général!#REF!,Général!F$134)))","v":"Equipage 9"},{"$f":"IF($P$5=\"Course 1\",Général!F$138,IF($P$5=\"Course 2\",Général!F$140,IF($P$5=\"Course 3\",Général!#REF!,Général!F$142)))","v":"Equipage 8"},{"$f":"IF($Q$5=\"Course 1\",Général!F$146,IF($Q$5=\"Course 2\",Général!F$148,IF($Q$5=\"Course 3\",Général!#REF!,Général!F$150)))","v":"Equipage 5"},{"$f":"IF($R$5=\"Course 1\",Général!F$154,IF($R$5=\"Course 2\",Général!F$156,IF($R$5=\"Course 3\",Général!F$158,Général!F$160)))","v":"Equipage 8"}]
["7ème Equipage",null,{"$f":"IF($C$5=\"Course 1\",Général!H34,IF($C$5=\"Course 2\",Général!H36,IF($C$5=\"Course 3\",Général!#REF!,Général!H38)))","v":0},{"$f":"IF($D$5=\"Course 1\",Général!H42,IF($D$5=\"Course 2\",Général!H44,IF($D$5=\"Course 3\",Général!#REF!,Général!H46)))","v":0},{"$f":"IF($E$5=\"Course 1\",Général!H50,IF($E$5=\"Course 2\",Général!H52,IF($E$5=\"Course 3\",Général!#REF!,Général!H54)))","v":0},{"$f":"IF($F$5=\"Course 1\",Général!H$58,IF($F$5=\"Course 2\",Général!H$60,IF($F$5=\"Course 3\",Général!#REF!,Général!H$62)))","v":0},{"$f":"IF($G$5=\"Course 1\",Général!H$66,IF($G$5=\"Course 2\",Général!H$68,IF($G$5=\"Course 3\",Général!#REF!,Général!H$70)))","v":0},{"$f":"IF($H$5=\"Course 1\",Général!H$74,IF($H$5=\"Course 2\",Général!H$76,IF($H$5=\"Course 3\",Général!#REF!,Général!H$78)))","v":0},{"$f":"IF($I$5=\"Course 1\",Général!H$82,IF($I$5=\"Course 2\",Général!H$84,IF($I$5=\"Course 3\",Général!#REF!,Général!H$86)))","v":0},{"$f":"IF($J$5=\"Course 1\",Général!H$90,IF($J$5=\"Course 2\",Général!H$92,IF($J$5=\"Course 3\",Général!#REF!,Général!H$94)))","v":0},{"$f":"IF($K$5=\"Course 1\",Général!H$98,IF($K$5=\"Course 2\",Général!H$100,IF($K$5=\"Course 3\",Général!#REF!,Général!H$102)))","v":0},{"$f":"IF($L$5=\"Course 1\",Général!H$106,IF($L$5=\"Course 2\",Général!H$108,IF($L$5=\"Course 3\",Général!#REF!,Général!H$110)))","v":0},{"$f":"IF($M$5=\"Course 1\",Général!H$114,IF($M$5=\"Course 2\",Général!H$116,IF($M$5=\"Course 3\",Général!#REF!,Général!H$118)))","v":0},{"$f":"IF($N$5=\"Course 1\",Général!H$122,IF($N$5=\"Course 2\",Général!H$124,IF($N$5=\"Course 3\",Général!#REF!,Général!H$126)))","v":0},{"$f":"IF($O$5=\"Course 1\",Général!H$130,IF($O$5=\"Course 2\",Général!H$132,IF($O$5=\"Course 3\",Général!#REF!,Général!H$134)))","v":0},{"$f":"IF($P$5=\"Course 1\",Général!H$138,IF($P$5=\"Course 2\",Général!H$140,IF($P$5=\"Course 3\",Général!#REF!,Général!H$142)))","v":0},{"$f":"IF($Q$5=\"Course 1\",Général!H$146,IF($Q$5=\"Course 2\",Général!H$148,IF($Q$5=\"Course 3\",Général!#REF!,Général!H$150)))","v":0},{"$f":"IF($R$5=\"Course 1\",Général!H$154,IF($R$5=\"Course 2\",Général!H$156,IF($R$5=\"Course 3\",Général!H$158,Général!H$160)))","v":0},null,null,null,{"$f":"Général!B14","v":"Equipage 14"},{"$f":"COUNTIF($C$8:$R$16,V13)","v":0}]
["8ème Equipage",null,{"$f":"IF($C$5=\"Course 1\",Général!I34,IF($C$5=\"Course 2\",Général!I36,IF($C$5=\"Course 3\",Général!#REF!,Général!I38)))","v":0},{"$f":"IF($D$5=\"Course 1\",Général!I42,IF($D$5=\"Course 2\",Général!I44,IF($D$5=\"Course 3\",Général!#REF!,Général!I46)))","v":0},{"$f":"IF($E$5=\"Course 1\",Général!I50,IF($E$5=\"Course 2\",Général!I52,IF($E$5=\"Course 3\",Général!#REF!,Général!I54)))","v":0},{"$f":"IF($F$5=\"Course 1\",Général!I$58,IF($F$5=\"Course 2\",Général!I$60,IF($F$5=\"Course 3\",Général!#REF!,Général!I$62)))","v":0},{"$f":"IF($G$5=\"Course 1\",Général!I$66,IF($G$5=\"Course 2\",Général!I$68,IF($G$5=\"Course 3\",Général!#REF!,Général!I$70)))","v":0},{"$f":"IF($H$5=\"Course 1\",Général!I$74,IF($H$5=\"Course 2\",Général!I$76,IF($H$5=\"Course 3\",Général!#REF!,Général!I$78)))","v":0},{"$f":"IF($I$5=\"Course 1\",Général!I$82,IF($I$5=\"Course 2\",Général!I$84,IF($I$5=\"Course 3\",Général!#REF!,Général!I$86)))","v":0},{"$f":"IF($J$5=\"Course 1\",Général!I$90,IF($J$5=\"Course 2\",Général!I$92,IF($J$5=\"Course 3\",Général!#REF!,Général!I$94)))","v":0},{"$f":"IF($K$5=\"Course 1\",Général!I$98,IF($K$5=\"Course 2\",Général!I$100,IF($K$5=\"Course 3\",Général!#REF!,Général!I$102)))","v":0},{"$f":"IF($L$5=\"Course 1\",Général!I$106,IF($L$5=\"Course 2\",Général!I$108,IF($L$5=\"Course 3\",Général!#REF!,Général!I$110)))","v":0},{"$f":"IF($M$5=\"Course 1\",Général!I$114,IF($M$5=\"Course 2\",Général!I$116,IF($M$5=\"Course 3\",Général!#REF!,Général!I$118)))","v":0},{"$f":"IF($N$5=\"Course 1\",Général!I$122,IF($N$5=\"Course 2\",Général!I$124,IF($N$5=\"Course 3\",Général!#REF!,Général!I$126)))","v":0},{"$f":"IF($O$5=\"Course 1\",Général!I$130,IF($O$5=\"Course 2\",Général!I$132,IF($O$5=\"Course 3\",Général!#REF!,Général!I$134)))","v":0},{"$f":"IF($P$5=\"Course 1\",Général!I$138,IF($P$5=\"Course 2\",Général!I$140,IF($P$5=\"Course 3\",Général!#REF!,Général!I$142)))","v":0},{"$f":"IF($Q$5=\"Course 1\",Général!I$146,IF($Q$5=\"Course 2\",Général!I$148,IF($Q$5=\"Course 3\",Général!#REF!,Général!I$150)))","v":0},{"$f":"IF($R$5=\"Course 1\",Général!I$154,IF($R$5=\"Course 2\",Général!I$156,IF($R$5=\"Course 3\",Général!I$158,Général!I$160)))","v":0},null,null,null,{"$f":"Général!B15","v":"Equipage 15"},0]
["9ème Equipage",null,{"$f":"IF($C$5=\"Course 1\",Général!J34,IF($C$5=\"Course 2\",Général!J36,IF($C$5=\"Course 3\",Général!#REF!,Général!J38)))","v":0},{"$f":"IF($D$5=\"Course 1\",Général!J42,IF($D$5=\"Course 2\",Général!J44,IF($D$5=\"Course 3\",Général!#REF!,Général!J46)))","v":0},{"$f":"IF($E$5=\"Course 1\",Général!J50,IF($E$5=\"Course 2\",Général!J52,IF($E$5=\"Course 3\",Général!#REF!,Général!J54)))","v":0},{"$f":"IF($F$5=\"Course 1\",Général!J$58,IF($F$5=\"Course 2\",Général!J$60,IF($F$5=\"Course 3\",Général!#REF!,Général!J$62)))","v":0},{"$f":"IF($G$5=\"Course 1\",Général!J$66,IF($G$5=\"Course 2\",Général!J$68,IF($G$5=\"Course 3\",Général!#REF!,Général!J$70)))","v":0},{"$f":"IF($H$5=\"Course 1\",Général!J$74,IF($H$5=\"Course 2\",Général!J$76,IF($H$5=\"Course 3\",Général!#REF!,Général!J$78)))","v":0},{"$f":"IF($I$5=\"Course 1\",Général!J$82,IF($I$5=\"Course 2\",Général!J$84,IF($I$5=\"Course 3\",Général!#REF!,Général!J$86)))","v":0},{"$f":"IF($J$5=\"Course 1\",Général!J$90,IF($J$5=\"Course 2\",Général!J$92,IF($J$5=\"Course 3\",Général!#REF!,Général!J$94)))","v":0},{"$f":"IF($K$5=\"Course 1\",Général!J$98,IF($K$5=\"Course 2\",Général!J$100,IF($K$5=\"Course 3\",Général!#REF!,Général!J$102)))","v":0},{"$f":"IF($L$5=\"Course 1\",Général!J$106,IF($L$5=\"Course 2\",Général!J$108,IF($L$5=\"Course 3\",Général!#REF!,Général!J$110)))","v":0},{"$f":"IF($M$5=\"Course 1\",Général!J$114,IF($M$5=\"Course 2\",Général!J$116,IF($M$5=\"Course 3\",Général!#REF!,Général!J$118)))","v":0},{"$f":"IF($N$5=\"Course 1\",Général!J$122,IF($N$5=\"Course 2\",Général!J$124,IF($N$5=\"Course 3\",Général!#REF!,Général!J$126)))","v":0},{"$f":"IF($O$5=\"Course 1\",Général!J$130,IF($O$5=\"Course 2\",Général!J$132,IF($O$5=\"Course 3\",Général!#REF!,Général!J$134)))","v":0},{"$f":"IF($P$5=\"Course 1\",Général!J$138,IF($P$5=\"Course 2\",Général!J$140,IF($P$5=\"Course 3\",Général!#REF!,Général!J$142)))","v":0},{"$f":"IF($Q$5=\"Course 1\",Général!J$146,IF($Q$5=\"Course 2\",Général!J$148,IF($Q$5=\"Course 3\",Général!#REF!,Général!J$150)))","v":0},{"$f":"IF($R$5=\"Course 1\",Général!J$154,IF($R$5=\"Course 2\",Général!J$156,IF($R$5=\"Course 3\",Général!J$158,Général!J$160)))","v":0},null,null,null,{"$f":"Général!B16","v":"Equipage 16"},0]
["10ème Equipage",null,{"$f":"IF($C$5=\"Course 1\",Général!K34,IF($C$5=\"Course 2\",Général!K36,IF($C$5=\"Course 3\",Général!#REF!,Général!K38)))","v":0},{"$f":"IF($D$5=\"Course 1\",Général!K42,IF($D$5=\"Course 2\",Général!K44,IF($D$5=\"Course 3\",Général!#REF!,Général!K46)))","v":0},{"$f":"IF($E$5=\"Course 1\",Général!K50,IF($E$5=\"Course 2\",Général!K52,IF($E$5=\"Course 3\",Général!#REF!,Général!K54)))","v":0},{"$f":"IF($F$5=\"Course 1\",Général!K$58,IF($F$5=\"Course 2\",Général!K$60,IF($F$5=\"Course 3\",Général!#REF!,Général!K$62)))","v":0},{"$f":"IF($G$5=\"Course 1\",Général!K$66,IF($G$5=\"Course 2\",Général!K$68,IF($G$5=\"Course 3\",Général!#REF!,Général!K$70)))","v":0},{"$f":"IF($H$5=\"Course 1\",Général!K$74,IF($H$5=\"Course 2\",Général!K$76,IF($H$5=\"Course 3\",Général!#REF!,Général!K$78)))","v":0},{"$f":"IF($I$5=\"Course 1\",Général!K$82,IF($I$5=\"Course 2\",Général!K$84,IF($I$5=\"Course 3\",Général!#REF!,Général!K$86)))","v":0},{"$f":"IF($J$5=\"Course 1\",Général!K$90,IF($J$5=\"Course 2\",Général!K$92,IF($J$5=\"Course 3\",Général!#REF!,Général!K$94)))","v":0},{"$f":"IF($K$5=\"Course 1\",Général!K$98,IF($K$5=\"Course 2\",Général!K$100,IF($K$5=\"Course 3\",Général!#REF!,Général!K$102)))","v":0},{"$f":"IF($L$5=\"Course 1\",Général!K$106,IF($L$5=\"Course 2\",Général!K$108,IF($L$5=\"Course 3\",Général!#REF!,Général!K$110)))","v":0},{"$f":"IF($M$5=\"Course 1\",Général!K$114,IF($M$5=\"Course 2\",Général!K$116,IF($M$5=\"Course 3\",Général!#REF!,Général!K$118)))","v":0},{"$f":"IF($N$5=\"Course 1\",Général!K$122,IF($N$5=\"Course 2\",Général!K$124,IF($N$5=\"Course 3\",Général!#REF!,Général!K$126)))","v":0},{"$f":"IF($O$5=\"Course 1\",Général!K$130,IF($O$5=\"Course 2\",Général!K$132,IF($O$5=\"Course 3\",Général!#REF!,Général!K$134)))","v":0},{"$f":"IF($P$5=\"Course 1\",Général!K$138,IF($P$5=\"Course 2\",Général!K$140,IF($P$5=\"Course 3\",Général!#REF!,Général!K$142)))","v":0},{"$f":"IF($Q$5=\"Course 1\",Général!K$146,IF($Q$5=\"Course 2\",Général!K$148,IF($Q$5=\"Course 3\",Général!#REF!,Général!K$150)))","v":0},{"$f":"IF($R$5=\"Course 1\",Général!K$154,IF($R$5=\"Course 2\",Général!K$156,IF($R$5=\"Course 3\",Général!K$158,Général!K$160)))","v":0},null,null,null,{"$f":"Général!B17","v":"Equipage 17"},0]
[null,null,null,null,null,null,null,null,null,null,null,null,null,null,null,null,null,null,null,null,null,{"$f":"Général!B18","v":"Equipage 18"},0]
[null,null,null,null,null,null,null,null,null,null,null,null,null,null,null,null,null,null,null,null,null,{"$f":"Général!B19","v":"Equipage 19"},0]
[null,null,null,null,null,null,null,null,null,null,null,null,null,null,null,null,null,null,null,null,null,{"$f":"Général!B20","v":"Equipage 20"},0]
[null,null,null,null,null,null,null,null,null,null,null,null,null,null,null,null,null,null,null,null,null,{"$f":"Général!B21","v":"Equipage 21"},0]
[null,null,null,null,null,null,null,null,null,null,null,null,null,null,null,null,null,null,null,null,null,{"$f":"Général!B22","v":"Equipage 22"},0]
[null,null,null,null,null,null,null,null,null,null,null,null,null,null,null,null,null,null,null,null,null,{"$f":"Général!B23","v":"Equipage 23"},0]
[null,null,null,null,null,null,null,null,null,null,null,null,null,null,null,null,null,null,null,null,null,{"$f":"Général!B24","v":"Equipage 24"},0]
[null,null,null,null,null,null,null,null,null,null,null,null,null,null,null,null,null,null,null,null,null,{"$f":"Général!B25","v":"Equipage 25"},0]
[null,null,null,null,null,null,null,null,null,null,null,null,null,null,null,null,null,null,null,null,null,{"$f":"Général!B26","v":"Equipage 26"},0]
[null,null,null,null,null,null,null,null,null,null,null,null,null,null,null,null,null,null,null,null,null,{"$f":"Général!B27","v":"Equipage 27"},0]
[null,null,null,null,null,null,null,null,null,null,null,null,null,null,null,null,null,null,null,null,null,{"$f":"Général!B28","v":"Equipage 28"},0]
[null,null,null,null,null,null,null,null,null,null,null,null,null,null,null,null,null,null,null,null,null,{"$f":"Général!B29","v":"Equipage 29"},0]
[null,null,null,null,null,null,null,null,null,null,null,null,null,null,null,null,null,null,null,null,null,{"$f":"Général!B30","v":"Equipage 30"},0]

{"sheet":"Eq.3","index":8,"n_rows":29,"n_cols":23,"rows_kept":29,"cut":false,"hidden":true,"merged":[[7,0,7,1],[0,0,1,5],[0,6,1,10],[3,0,3,1],[4,0,4,1],[5,0,5,1],[14,0,14,1],[15,0,15,1],[8,0,8,1],[9,0,9,1],[10,0,10,1],[11,0,11,1],[12,0,12,1],[13,0,13,1]]}
["Equipage ",null,null,null,null,null,{"$f":"Général!B5","v":"Equipage 3"},null,null,null,null,null,null,null,null,null,null,null,null,null,null,{"$f":"Général!B3","v":"Equipage 1"},{"$f":"COUNTIF(C$8:R$16,V1)","v":8}]
[null,null,null,null,null,null,null,null,null,null,null,null,null,null,null,null,null,null,null,null,null,{"$f":"Général!B4","v":"Equipage 2"},{"$f":"COUNTIF($C$8:$R$16,V2)","v":11}]
[null,null,null,null,null,null,null,null,null,null,null,null,null,null,null,null,null,null,null,null,null,{"$f":"Général!B5","v":"Equipage 3"},16]
[null,null,"FLIGHT 1","FLIGHT 2","FLIGHT 3","FLIGHT 4","FLIGHT 5","FLIGHT 6","FLIGHT 7","FLIGHT 8","FLIGHT 9","FLIGHT 10","FLIGHT 11","FLIGHT 12","FLIGHT 13","FLIGHT 14","FLIGHT 15","FLIGHT 16","FLIGHT 17","FLIGHT 18",null,{"$f":"Général!B6","v":"Equipage 4"},2]
["N° de course",null,{"$f":"IF(COUNTIF(Général!B34:K34,$G$1)=1,\"Course 1\",IF(COUNTIF(Général!B36:K36,$G$1)=1,\"Course 2\",IF(COUNTIF(Général!#REF!,$G$1)=1,\"Course 3\",\"Course 4\")))","v":"Course 2"},{"$f":"IF(COUNTIF(Général!B42:K42,$G$1)=1,\"Course 1\",IF(COUNTIF(Général!B44:K44,$G$1)=1,\"Course 2\",IF(COUNTIF(Général!#REF!,$G$1)=1,\"Course 3\",\"Course 4\")))","v":"Course 2"},{"$f":"IF(COUNTIF(Général!B50:K50,$G$1)=1,\"Course 1\",IF(COUNTIF(Général!B52:K52,$G$1)=1,\"Course 2\",IF(COUNTIF(Général!#REF!,$G$1)=1,\"Course 3\",\"Course 4\")))","v":"Course 2"},{"$f":"IF(COUNTIF(Général!B58:K58,$G$1)=1,\"Course 1\",IF(COUNTIF(Général!B60:K60,$G$1)=1,\"Course 2\",IF(COUNTIF(Général!#REF!,$G$1)=1,\"Course 3\",\"Course 4\")))","v":"Course 1"},{"$f":"IF(COUNTIF(Général!B66:K66,$G$1)=1,\"Course 1\",IF(COUNTIF(Général!B68:K68,$G$1)=1,\"Course 2\",IF(COUNTIF(Général!#REF!,$G$1)=1,\"Course 3\",\"Course 4\")))","v":"Course 1"},{"$f":"IF(COUNTIF(Général!B74:K74,$G$1)=1,\"Course 1\",IF(COUNTIF(Général!B76:K76,$G$1)=1,\"Course 2\",IF(COUNTIF(Général!#REF!,$G$1)=1,\"Course 3\",\"Course 4\")))","v":"Course 1"},{"$f":"IF(COUNTIF(Général!B82:K82,$G$1)=1,\"Course 1\",IF(COUNTIF(Général!B84:K84,$G$1)=1,\"Course 2\",IF(COUNTIF(Général!#REF!,$G$1)=1,\"Course 3\",\"Course 4\")))","v":"Course 2"},{"$f":"IF(COUNTIF(Général!B90:K90,$G$1)=1,\"Course 1\",IF(COUNTIF(Général!B92:K92,$G$1)=1,\"Course 2\",IF(COUNTIF(Général!#REF!,$G$1)=1,\"Course 3\",\"Course 4\")))","v":"Course 2"},{"$f":"IF(COUNTIF(Général!B98:K98,$G$1)=1,\"Course 1\",IF(COUNTIF(Général!B100:K100,$G$1)=1,\"Course 2\",IF(COUNTIF(Général!#REF!,$G$1)=1,\"Course 3\",\"Course 4\")))","v":"Course 2"},{"$f":"IF(COUNTIF(Général!B106:K106,$G$1)=1,\"Course 1\",IF(COUNTIF(Général!B108:K108,$G$1)=1,\"Course 2\",IF(COUNTIF(Général!#REF!,$G$1)=1,\"Course 3\",\"Course 4\")))","v":"Course 1"},{"$f":"IF(COUNTIF(Général!B114:K114,$G$1)=1,\"Course 1\",IF(COUNTIF(Général!B116:K116,$G$1)=1,\"Course 2\",IF(COUNTIF(Général!#REF!,$G$1)=1,\"Course 3\",\"Course 4\")))","v":"Course 2"},{"$f":"IF(COUNTIF(Général!B122:K122,$G$1)=1,\"Course 1\",IF(COUNTIF(Général!B124:K124,$G$1)=1,\"Course 2\",IF(COUNTIF(Général!#REF!,$G$1)=1,\"Course 3\",\"Course 4\")))","v":"Course 1"},{"$f":"IF(COUNTIF(Général!B130:K130,$G$1)=1,\"Course 1\",IF(COUNTIF(Général!B132:K132,$G$1)=1,\"Course 2\",IF(COUNTIF(Général!#REF!,$G$1)=1,\"Course 3\",\"Course 4\")))","v":"Course 1"},{"$f":"IF(COUNTIF(Général!B138:K138,$G$1)=1,\"Course 1\",IF(COUNTIF(Général!B140:K140,$G$1)=1,\"Course 2\",IF(COUNTIF(Général!#REF!,$G$1)=1,\"Course 3\",\"Course 4\")))","v":"Course 2"},{"$f":"IF(COUNTIF(Général!B146:K146,$G$1)=1,\"Course 1\",IF(COUNTIF(Général!B148:K148,$G$1)=1,\"Course 2\",IF(COUNTIF(Général!#REF!,$G$1)=1,\"Course 3\",\"Course 4\")))","v":"Course 2"},{"$f":"IF(COUNTIF(Général!B154:K154,$G$1)=1,\"Course 1\",IF(COUNTIF(Général!B156:K156,$G$1)=1,\"Course 2\",IF(COUNTIF(Général!B158:K158,$G$1)=1,\"Course 3\",\"Course 4\")))","v":"Course 2"},{"$f":"IF(COUNTIF(Général!C154:L154,$G$1)=1,\"Course 1\",IF(COUNTIF(Général!C156:L156,$G$1)=1,\"Course 2\",IF(COUNTIF(Général!C158:L158,$G$1)=1,\"Course 3\",\"Course 4\")))","v":"Course 4"},{"$f":"IF(COUNTIF(Général!D154:M154,$G$1)=1,\"Course 1\",IF(COUNTIF(Général!D156:M156,$G$1)=1,\"Course 2\",IF(COUNTIF(Général!D158:M158,$G$1)=1,\"Course 3\",\"Course 4\")))","v":"Course 4"},null,{"$f":"Général!B7","v":"Equipage 5"},5]
["Bateau",null,{"$f":"IF(COUNTIF(Général!B34:B38,$G$1)=1,\"Boat 1\",IF(COUNTIF(Général!C34:C38,$G$1)=1,\"Boat 2\",IF(COUNTIF(Général!D34:D38,$G$1)=1,\"Boat 3\",IF(COUNTIF(Général!E34:E38,$G$1)=1,\"Boat 4\",IF(COUNTIF(Général!F34:F38,$G$1)=1,\"Boat 5\",IF(COUNTIF(Général!G34:G38,$G$1)=1,\"Boat 6\",IF(COUNTIF(Général!H34:H38,$G$1)=1,\"Boat 7\",IF(COUNTIF(Général!I34:I38,$G$1)=1,\"Boat 8\",IF(COUNTIF(Général!J34:J38,$G$1)=1,\"Boat 9\",\"Boat10\")))))))))","v":"Boat 4"},{"$f":"IF(COUNTIF(Général!B42:B46,$G$1)=1,\"Boat 1\",IF(COUNTIF(Général!C42:C46,$G$1)=1,\"Boat 2\",IF(COUNTIF(Général!D42:D46,$G$1)=1,\"Boat 3\",IF(COUNTIF(Général!E42:E46,$G$1)=1,\"Boat 4\",IF(COUNTIF(Général!F42:F46,$G$1)=1,\"Boat 5\",IF(COUNTIF(Général!G42:G46,$G$1)=1,\"Boat 6\",IF(COUNTIF(Général!H42:H46,$G$1)=1,\"Boat 7\",IF(COUNTIF(Général!I42:I46,$G$1)=1,\"Boat 8\",IF(COUNTIF(Général!J42:J46,$G$1)=1,\"Boat 9\",\"Boat 10\")))))))))","v":"Boat 3"},{"$f":"IF(COUNTIF(Général!B50:B54,$G$1)=1,\"Boat 1\",IF(COUNTIF(Général!C50:C54,$G$1)=1,\"Boat 2\",IF(COUNTIF(Général!D50:D54,$G$1)=1,\"Boat 3\", IF(COUNTIF(Général!E50:E54,$G$1)=1,\"Boat 4\", IF(COUNTIF(Général!F50:F54,$G$1)=1,\"Boat 5\", IF(COUNTIF(Général!G50:G54,$G$1)=1,\"Boat 6\", IF(COUNTIF(Général!H50:H54,$G$1)=1,\"Boat 7\",IF(COUNTIF(Général!I50:I54,$G$1)=1,\"Boat 8\",IF(COUNTIF(Général!J50:J54,$G$1)=1,\"Boat 9\",\"Boat 10\")))))))))","v":"Boat 3"},{"$f":"IF(COUNTIF(Général!B58:B62,$G$1)=1,\"Boat 1\",IF(COUNTIF(Général!C58:C62,$G$1)=1,\"Boat 2\",IF(COUNTIF(Général!D58:D62,$G$1)=1,\"Boat 3\", IF(COUNTIF(Général!E58:E62,$G$1)=1,\"Boat 4\", IF(COUNTIF(Général!F58:F62,$G$1)=1,\"Boat 5\", IF(COUNTIF(Général!G58:G62,$G$1)=1,\"Boat 6\", IF(COUNTIF(Général!H58:H62,$G$1)=1,\"Boat 7\",IF(COUNTIF(Général!I58:I62,$G$1)=1,\"Boat 8\",IF(COUNTIF(Général!I58:J62,$G$1)=1,\"Boat 9\",\"Boat 10\")))))))))","v":"Boat 3"},{"$f":"IF(COUNTIF(Général!B66:B70,$G$1)=1,\"Boat 1\",IF(COUNTIF(Général!C66:C70,$G$1)=1,\"Boat 2\",IF(COUNTIF(Général!D66:D70,$G$1)=1,\"Boat 3\", IF(COUNTIF(Général!E66:E70,$G$1)=1,\"Boat 4\", IF(COUNTIF(Général!F66:F70,$G$1)=1,\"Boat 5\", IF(COUNTIF(Général!G66:G70,$G$1)=1,\"Boat 6\", IF(COUNTIF(Général!H66:H70,$G$1)=1,\"Boat 7\",IF(COUNTIF(Général!I66:I70,$G$1)=1,\"Boat 8\",IF(COUNTIF(Général!J66:J70,$G$1)=1,\"Boat 9\",\"Boat 10\")))))))))","v":"Boat 2"},{"$f":"IF(COUNTIF(Général!B74:B78,$G$1)=1,\"Boat 1\",IF(COUNTIF(Général!C74:C78,$G$1)=1,\"Boat 2\",IF(COUNTIF(Général!D74:D78,$G$1)=1,\"Boat 3\", IF(COUNTIF(Général!E74:E78,$G$1)=1,\"Boat 4\", IF(COUNTIF(Général!F74:F78,$G$1)=1,\"Boat 5\", IF(COUNTIF(Général!G74:G78,$G$1)=1,\"Boat 6\", IF(COUNTIF(Général!H74:H78,$G$1)=1,\"Boat 7\",IF(COUNTIF(Général!I74:I78,$G$1)=1,\"Boat 8\",IF(COUNTIF(Général!J74:J78,$G$1)=1,\"Boat 9\",\"Boat 10\")))))))))","v":"Boat 1"},{"$f":"IF(COUNTIF(Général!B82:B86,$G$1)=1,\"Boat 1\",IF(COUNTIF(Général!C82:C86,$G$1)=1,\"Boat 2\",IF(COUNTIF(Général!D82:D86,$G$1)=1,\"Boat 3\", IF(COUNTIF(Général!E82:E86,$G$1)=1,\"Boat 4\", IF(COUNTIF(Général!F82:F86,$G$1)=1,\"Boat 5\", IF(COUNTIF(Général!G82:G86,$G$1)=1,\"Boat 6\", IF(COUNTIF(Général!H82:H86,$G$1)=1,\"Boat 7\",IF(COUNTIF(Général!I82:I86,$G$1)=1,\"Boat 8\",IF(COUNTIF(Général!J82:J86,$G$1)=1,\"Boat 9\",\"Boat 10\")))))))))","v":"Boat 4"},{"$f":"IF(COUNTIF(Général!B90:B94,$G$1)=1,\"Boat 1\",IF(COUNTIF(Général!C90:C94,$G$1)=1,\"Boat 2\",IF(COUNTIF(Général!D90:D94,$G$1)=1,\"Boat 3\", IF(COUNTIF(Général!E90:E94,$G$1)=1,\"Boat 4\", IF(COUNTIF(Général!F90:F94,$G$1)=1,\"Boat 5\", IF(COUNTIF(Général!G90:G94,$G$1)=1,\"Boat 6\", IF(COUNTIF(Général!H90:H94,$G$1)=1,\"Boat 7\",IF(COUNTIF(Général!I90:I94,$G$1)=1,\"Boat 8\",IF(COUNTIF(Général!J90:J94,$G$1)=1,\"Boat 9\",\"Boat 10\")))))))))","v":"Boat 3"},{"$f":"IF(COUNTIF(Général!B98:B102,$G$1)=1,\"Boat 1\",IF(COUNTIF(Général!C98:C102,$G$1)=1,\"Boat 2\",IF(COUNTIF(Général!D98:D102,$G$1)=1,\"Boat 3\", IF(COUNTIF(Général!E98:E102,$G$1)=1,\"Boat 4\", IF(COUNTIF(Général!F98:F102,$G$1)=1,\"Boat 5\", IF(COUNTIF(Général!G98:G102,$G$1)=1,\"Boat 6\", IF(COUNTIF(Général!H98:H102,$G$1)=1,\"Boat 7\",IF(COUNTIF(Général!I98:I102,$G$1)=1,\"Boat 8\",IF(COUNTIF(Général!J98:J102,$G$1)=1,\"Boat 9\",\"Boat 10\")))))))))","v":"Boat 1"},{"$f":"IF(COUNTIF(Général!B106:B110,$G$1)=1,\"Boat 1\",IF(COUNTIF(Général!C106:C110,$G$1)=1,\"Boat 2\",IF(COUNTIF(Général!D106:D110,$G$1)=1,\"Boat 3\", IF(COUNTIF(Général!E106:E110,$G$1)=1,\"Boat 4\", IF(COUNTIF(Général!F106:F110,$G$1)=1,\"Boat 5\", IF(COUNTIF(Général!G106:G110,$G$1)=1,\"Boat 6\", IF(COUNTIF(Général!H106:H110,$G$1)=1,\"Boat 7\",IF(COUNTIF(Général!I106:I110,$G$1)=1,\"Boat 8\",IF(COUNTIF(Général!J106:J110,$G$1)=1,\"Boat 9\",\"Boat 10\")))))))))","v":"Boat 1"},{"$f":"IF(COUNTIF(Général!B114:B118,$G$1)=1,\"Boat 1\",IF(COUNTIF(Général!C114:C118,$G$1)=1,\"Boat 2\",IF(COUNTIF(Général!C114:D118,$G$1)=1,\"Boat 3\", IF(COUNTIF(Général!C114:E118,$G$1)=1,\"Boat 4\", IF(COUNTIF(Général!F114:F118,$G$1)=1,\"Boat 5\", IF(COUNTIF(Général!G114:G118,$G$1)=1,\"Boat 6\", IF(COUNTIF(Général!H114:H118,$G$1)=1,\"Boat 7\",IF(COUNTIF(Général!I114:I118,$G$1)=1,\"Boat 8\",IF(COUNTIF(Général!J114:J118,$G$1)=1,\"Boat 9\",\"Boat 10\")))))))))","v":"Boat 5"},{"$f":"IF(COUNTIF(Général!B122:B126,$G$1)=1,\"Boat 1\",IF(COUNTIF(Général!C122:C126,$G$1)=1,\"Boat 2\",IF(COUNTIF(Général!D122:D126,$G$1)=1,\"Boat 3\", IF(COUNTIF(Général!E122:E126,$G$1)=1,\"Boat 4\", IF(COUNTIF(Général!F122:F126,$G$1)=1,\"Boat 5\", IF(COUNTIF(Général!G122:G126,$G$1)=1,\"Boat 6\", IF(COUNTIF(Général!H122:H126,$G$1)=1,\"Boat 7\",IF(COUNTIF(Général!I122:I126,$G$1)=1,\"Boat 8\",IF(COUNTIF(Général!J122:J126,$G$1)=1,\"Boat 9\",\"Boat 10\")))))))))","v":"Boat 5"},{"$f":"IF(COUNTIF(Général!B130:B134,$G$1)=1,\"Boat 1\",IF(COUNTIF(Général!C130:C134,$G$1)=1,\"Boat 2\",IF(COUNTIF(Général!D130:D134,$G$1)=1,\"Boat 3\", IF(COUNTIF(Général!E130:E134,$G$1)=1,\"Boat 4\", IF(COUNTIF(Général!F130:F134,$G$1)=1,\"Boat 5\", IF(COUNTIF(Général!G130:G134,$G$1)=1,\"Boat 6\", IF(COUNTIF(Général!H130:H134,$G$1)=1,\"Boat 7\",IF(COUNTIF(Général!I130:I134,$G$1)=1,\"Boat 8\",IF(COUNTIF(Général!J130:J134,$G$1)=1,\"Boat 9\",\"Boat 10\")))))))))","v":"Boat 2"},{"$f":"IF(COUNTIF(Général!B138:B142,$G$1)=1,\"Boat 1\",IF(COUNTIF(Général!C138:C142,$G$1)=1,\"Boat 2\",IF(COUNTIF(Général!D138:D142,$G$1)=1,\"Boat 3\", IF(COUNTIF(Général!E138:E142,$G$1)=1,\"Boat 4\", IF(COUNTIF(Général!F138:F142,$G$1)=1,\"Boat 5\", IF(COUNTIF(Général!G138:G142,$G$1)=1,\"Boat 6\", IF(COUNTIF(Général!H138:H142,$G$1)=1,\"Boat 7\",IF(COUNTIF(Général!I138:I142,$G$1)=1,\"Boat 8\",IF(COUNTIF(Général!J138:J142,$G$1)=1,\"Boat 9\",\"Boat 10\")))))))))","v":"Boat 5"},{"$f":"IF(COUNTIF(Général!B146:B150,$G$1)=1,\"Boat 1\",IF(COUNTIF(Général!C146:C150,$G$1)=1,\"Boat 2\",IF(COUNTIF(Général!D146:D150,$G$1)=1,\"Boat 3\", IF(COUNTIF(Général!E146:E150,$G$1)=1,\"Boat 4\", IF(COUNTIF(Général!F146:F150,$G$1)=1,\"Boat 5\", IF(COUNTIF(Général!G146:G150,$G$1)=1,\"Boat 6\", IF(COUNTIF(Général!H146:H150,$G$1)=1,\"Boat 7\",IF(COUNTIF(Général!I146:I150,$G$1)=1,\"Boat 8\",IF(COUNTIF(Général!J146:J150,$G$1)=1,\"Boat 9\",\"Boat 10\")))))))))","v":"Boat 5"},{"$f":"IF(COUNTIF(Général!B154:B157,$G$1)=1,\"Boat 1\",IF(COUNTIF(Général!C154:C157,$G$1)=1,\"Boat 2\",IF(COUNTIF(Général!D154:D157,$G$1)=1,\"Boat 3\", IF(COUNTIF(Général!E154:E157,$G$1)=1,\"Boat 4\", IF(COUNTIF(Général!F154:F157,$G$1)=1,\"Boat 5\", IF(COUNTIF(Général!G154:G157,$G$1)=1,\"Boat 6\", IF(COUNTIF(Général!H154:H157,$G$1)=1,\"Boat 7\",IF(COUNTIF(Général!I154:I157,$G$1)=1,\"Boat 8\",IF(COUNTIF(Général!J154:J157,$G$1)=1,\"Boat 9\",\"Boat 10\")))))))))","v":"Boat 1"},{"$f":"IF(COUNTIF(Général!B160:B163,$G$1)=1,\"Boat 1\",IF(COUNTIF(Général!C160:C163,$G$1)=1,\"Boat 2\",IF(COUNTIF(Général!D160:D163,$G$1)=1,\"Boat 3\", IF(COUNTIF(Général!E160:E163,$G$1)=1,\"Boat 4\", IF(COUNTIF(Général!F160:F163,$G$1)=1,\"Boat 5\", IF(COUNTIF(Général!G160:G163,$G$1)=1,\"Boat 6\", IF(COUNTIF(Général!H160:H163,$G$1)=1,\"Boat 7\",IF(COUNTIF(Général!I160:I163,$G$1)=1,\"Boat 8\",IF(COUNTIF(Général!J160:J163,$G$1)=1,\"Boat 9\",\"Boat 10\")))))))))","v":"Boat 1"},{"$f":"IF(COUNTIF(Général!B166:B169,$G$1)=1,\"Boat 1\",IF(COUNTIF(Général!C166:C169,$G$1)=1,\"Boat 2\",IF(COUNTIF(Général!D166:D169,$G$1)=1,\"Boat 3\", IF(COUNTIF(Général!E166:E169,$G$1)=1,\"Boat 4\", IF(COUNTIF(Général!F166:F169,$G$1)=1,\"Boat 5\", IF(COUNTIF(Général!G166:G169,$G$1)=1,\"Boat 6\", IF(COUNTIF(Général!H166:H169,$G$1)=1,\"Boat 7\",IF(COUNTIF(Général!I166:I169,$G$1)=1,\"Boat 8\",IF(COUNTIF(Général!J166:J169,$G$1)=1,\"Boat 9\",\"Boat 10\")))))))))","v":"Boat 1"},null,{"$f":"Général!B8","v":"Equipage 6"},8]
[null,null,null,null,null,null,null,null,null,null,null,null,null,null,null,null,null,null,null,null,null,{"$f":"Général!B9","v":"Equipage 7"},9]
["1er Equipage",null,{"$f":"IF($C$5=\"Course 1\",Général!B34,IF($C$5=\"Course 2\",Général!B36,IF($C$5=\"Course 3\",Général!#REF!,Général!B38)))","v":"Equipage 8"},{"$f":"IF($D$5=\"Course 1\",Général!B42,IF($D$5=\"Course 2\",Général!B44,IF($D$5=\"Course 3\",Général!#REF!,Général!B46)))","v":"Equipage 5"},{"$f":"IF($E$5=\"Course 1\",Général!B50,IF($E$5=\"Course 2\",Général!B52,IF($E$5=\"Course 3\",Général!#REF!,Général!B54)))","v":"Equipage 1"},{"$f":"IF($F$5=\"Course 1\",Général!B$58,IF($F$5=\"Course 2\",Général!B$60,IF($F$5=\"Course 3\",Général!#REF!,Général!B$62)))","v":"Equipage 10"},{"$f":"IF($G$5=\"Course 1\",Général!B$66,IF($G$5=\"Course 2\",Général!B$68,IF($G$5=\"Course 3\",Général!#REF!,Général!B$70)))","v":"Equipage 2"},{"$f":"IF($H$5=\"Course 1\",Général!B$74,IF($H$5=\"Course 2\",Général!B$76,IF($H$5=\"Course 3\",Général!#REF!,Général!B$78)))","v":"Equipage 3"},{"$f":"IF($I$5=\"Course 1\",Général!B$82,IF($I$5=\"Course 2\",Général!B$84,IF($I$5=\"Course 3\",Général!#REF!,Général!B$86)))","v":"Equipage 6"},{"$f":"IF($J$5=\"Course 1\",Général!B$90,IF($J$5=\"Course 2\",Général!B$92,IF($J$5=\"Course 3\",Général!#REF!,Général!B$94)))","v":"Equipage 10"},{"$f":"IF($K$5=\"Course 1\",Général!B$98,IF($K$5=\"Course 2\",Général!B$100,IF($K$5=\"Course 3\",Général!#REF!,Général!B$102)))","v":"Equipage 3"},{"$f":"IF($L$5=\"Course 1\",Général!B$106,IF($L$5=\"Course 2\",Général!B$108,IF($L$5=\"Course 3\",Général!#REF!,Général!B$110)))","v":"Equipage 3"},{"$f":"IF($M$5=\"Course 1\",Général!B$114,IF($M$5=\"Course 2\",Général!B$116,IF($M$5=\"Course 3\",Général!#REF!,Général!B$118)))","v":"Equipage 1"},{"$f":"IF($N$5=\"Course 1\",Général!B$122,IF($N$5=\"Course 2\",Général!B$124,IF($N$5=\"Course 3\",Général!#REF!,Général!B$126)))","v":"Equipage 9"},{"$f":"IF($O$5=\"Course 1\",Général!B$130,IF($O$5=\"Course 2\",Général!B$132,IF($O$5=\"Course 3\",Général!#REF!,Général!B$134)))","v":"Equipage 8"},{"$f":"IF($P$5=\"Course 1\",Général!B$138,IF($P$5=\"Course 2\",Général!B$140,IF($P$5=\"Course 3\",Général!#REF!,Général!B$142)))","v":"Equipage 7"},{"$f":"IF($Q$5=\"Course 1\",Général!B$146,IF($Q$5=\"Course 2\",Général!B$148,IF($Q$5=\"Course 3\",Général!#REF!,Général!B$150)))","v":"Equipage 9"},{"$f":"IF($R$5=\"Course 1\",Général!B$154,IF($R$5=\"Course 2\",Général!B$156,IF($R$5=\"Course 3\",Général!B$158,Général!B$160)))","v":"Equipage 3"},null,null,null,{"$f":"Général!B10","v":"Equipage 8"},5]
["2nd Equipage",null,{"$f":"IF($C$5=\"Course 1\",Général!C34,IF($C$5=\"Course 2\",Général!C36,IF($C$5=\"Course 3\",Général!#REF!,Général!C38)))","v":"Equipage 5"},{"$f":"IF($D$5=\"Course 1\",Général!C42,IF($D$5=\"Course 2\",Général!C44,IF($D$5=\"Course 3\",Général!#REF!,Général!C46)))","v":"Equipage 2"},{"$f":"IF($E$5=\"Course 1\",Général!C50,IF($E$5=\"Course 2\",Général!C52,IF($E$5=\"Course 3\",Général!#REF!,Général!C54)))","v":"Equipage 2"},{"$f":"IF($F$5=\"Course 1\",Général!C$58,IF($F$5=\"Course 2\",Général!C$60,IF($F$5=\"Course 3\",Général!#REF!,Général!C$62)))","v":"Equipage 7"},{"$f":"IF($G$5=\"Course 1\",Général!C$66,IF($G$5=\"Course 2\",Général!C$68,IF($G$5=\"Course 3\",Général!#REF!,Général!C$70)))","v":"Equipage 3"},{"$f":"IF($H$5=\"Course 1\",Général!C$74,IF($H$5=\"Course 2\",Général!C$76,IF($H$5=\"Course 3\",Général!#REF!,Général!C$78)))","v":"Equipage 7"},{"$f":"IF($I$5=\"Course 1\",Général!C$82,IF($I$5=\"Course 2\",Général!C$84,IF($I$5=\"Course 3\",Général!#REF!,Général!C$86)))","v":"Equipage 9"},{"$f":"IF($J$5=\"Course 1\",Général!C$90,IF($J$5=\"Course 2\",Général!C$92,IF($J$5=\"Course 3\",Général!#REF!,Général!C$94)))","v":"Equipage 1"},{"$f":"IF($K$5=\"Course 1\",Général!C$98,IF($K$5=\"Course 2\",Général!C$100,IF($K$5=\"Course 3\",Général!#REF!,Général!C$102)))","v":"Equipage 8"},{"$f":"IF($L$5=\"Course 1\",Général!C$106,IF($L$5=\"Course 2\",Général!C$108,IF($L$5=\"Course 3\",Général!#REF!,Général!C$110)))","v":"Equipage 6"},{"$f":"IF($M$5=\"Course 1\",Général!C$114,IF($M$5=\"Course 2\",Général!C$116,IF($M$5=\"Course 3\",Général!#REF!,Général!C$118)))","v":"Equipage 7"},{"$f":"IF($N$5=\"Course 1\",Général!C$122,IF($N$5=\"Course 2\",Général!C$124,IF($N$5=\"Course 3\",Général!#REF!,Général!C$126)))","v":"Equipage 6"},{"$f":"IF($O$5=\"Course 1\",Général!C$130,IF($O$5=\"Course 2\",Général!C$132,IF($O$5=\"Course 3\",Général!#REF!,Général!C$134)))","v":"Equipage 3"},{"$f":"IF($P$5=\"Course 1\",Général!C$138,IF($P$5=\"Course 2\",Général!C$140,IF($P$5=\"Course 3\",Général!#REF!,Général!C$142)))","v":"Equipage 1"},{"$f":"IF($Q$5=\"Course 1\",Général!C$146,IF($Q$5=\"Course 2\",Général!C$148,IF($Q$5=\"Course 3\",Général!#REF!,Général!C$150)))","v":"Equipage 7"},{"$f":"IF($R$5=\"Course 1\",Général!C$154,IF($R$5=\"Course 2\",Général!C$156,IF($R$5=\"Course 3\",Général!C$158,Général!C$160)))","v":"Equipage 9"},null,null,null,{"$f":"Général!B11","v":"Equipage 9"},9]
["3ème Equipage",null,{"$f":"IF($C$5=\"Course 1\",Général!D34,IF($C$5=\"Course 2\",Général!D36,IF($C$5=\"Course 3\",Général!#REF!,Général!D38)))","v":"Equipage 9"},{"$f":"IF($D$5=\"Course 1\",Général!D42,IF($D$5=\"Course 2\",Général!D44,IF($D$5=\"Course 3\",Général!#REF!,Général!D46)))","v":"Equipage 3"},{"$f":"IF($E$5=\"Course 1\",Général!D50,IF($E$5=\"Course 2\",Général!D52,IF($E$5=\"Course 3\",Général!#REF!,Général!D54)))","v":"Equipage 3"},{"$f":"IF($F$5=\"Course 1\",Général!D$58,IF($F$5=\"Course 2\",Général!D$60,IF($F$5=\"Course 3\",Général!#REF!,Général!D$62)))","v":"Equipage 3"},{"$f":"IF($G$5=\"Course 1\",Général!D$66,IF($G$5=\"Course 2\",Général!D$68,IF($G$5=\"Course 3\",Général!#REF!,Général!D$70)))","v":"Equipage 6"},{"$f":"IF($H$5=\"Course 1\",Général!D$74,IF($H$5=\"Course 2\",Général!D$76,IF($H$5=\"Course 3\",Général!#REF!,Général!D$78)))","v":"Equipage 2"},{"$f":"IF($I$5=\"Course 1\",Général!D$82,IF($I$5=\"Course 2\",Général!D$84,IF($I$5=\"Course 3\",Général!#REF!,Général!D$86)))","v":"Equipage 1"},{"$f":"IF($J$5=\"Course 1\",Général!D$90,IF($J$5=\"Course 2\",Général!D$92,IF($J$5=\"Course 3\",Général!#REF!,Général!D$94)))","v":"Equipage 3"},{"$f":"IF($K$5=\"Course 1\",Général!D$98,IF($K$5=\"Course 2\",Général!D$100,IF($K$5=\"Course 3\",Général!#REF!,Général!D$102)))","v":"Equipage 5"},{"$f":"IF($L$5=\"Course 1\",Général!D$106,IF($L$5=\"Course 2\",Général!D$108,IF($L$5=\"Course 3\",Général!#REF!,Général!D$110)))","v":"Equipage 5"},{"$f":"IF($M$5=\"Course 1\",Général!D$114,IF($M$5=\"Course 2\",Général!D$116,IF($M$5=\"Course 3\",Général!#REF!,Général!D$118)))","v":"Equipage 10"},{"$f":"IF($N$5=\"Course 1\",Général!D$122,IF($N$5=\"Course 2\",Général!D$124,IF($N$5=\"Course 3\",Général!#REF!,Général!D$126)))","v":"Equipage 10"},{"$f":"IF($O$5=\"Course 1\",Général!D$130,IF($O$5=\"Course 2\",Général!D$132,IF($O$5=\"Course 3\",Général!#REF!,Général!D$134)))","v":"Equipage 2"},{"$f":"IF($P$5=\"Course 1\",Général!D$138,IF($P$5=\"Course 2\",Général!D$140,IF($P$5=\"Course 3\",Général!#REF!,Général!D$142)))","v":"Equipage 10"},{"$f":"IF($Q$5=\"Course 1\",Général!D$146,IF($Q$5=\"Course 2\",Général!D$148,IF($Q$5=\"Course 3\",Général!#REF!,Général!D$150)))","v":"Equipage 10"},{"$f":"IF($R$5=\"Course 1\",Général!D$154,IF($R$5=\"Course 2\",Général!D$156,IF($R$5=\"Course 3\",Général!D$158,Général!D$160)))","v":"Equipage 2"},null,null,null,{"$f":"Général!B12","v":"Equipage 10"},7]
["4ème Equipage",null,{"$f":"IF($C$5=\"Course 1\",Général!E34,IF($C$5=\"Course 2\",Général!E36,IF($C$5=\"Course 3\",Général!#REF!,Général!E38)))","v":"Equipage 3"},{"$f":"IF($D$5=\"Course 1\",Général!E42,IF($D$5=\"Course 2\",Général!E44,IF($D$5=\"Course 3\",Général!#REF!,Général!E46)))","v":"Equipage 1"},{"$f":"IF($E$5=\"Course 1\",Général!E50,IF($E$5=\"Course 2\",Général!E52,IF($E$5=\"Course 3\",Général!#REF!,Général!E54)))","v":"Equipage 9"},{"$f":"IF($F$5=\"Course 1\",Général!E$58,IF($F$5=\"Course 2\",Général!E$60,IF($F$5=\"Course 3\",Général!#REF!,Général!E$62)))","v":"Equipage 9"},{"$f":"IF($G$5=\"Course 1\",Général!E$66,IF($G$5=\"Course 2\",Général!E$68,IF($G$5=\"Course 3\",Général!#REF!,Général!E$70)))","v":"Equipage 9"},{"$f":"IF($H$5=\"Course 1\",Général!E$74,IF($H$5=\"Course 2\",Général!E$76,IF($H$5=\"Course 3\",Général!#REF!,Général!E$78)))","v":"Equipage 6"},{"$f":"IF($I$5=\"Course 1\",Général!E$82,IF($I$5=\"Course 2\",Général!E$84,IF($I$5=\"Course 3\",Général!#REF!,Général!E$86)))","v":"Equipage 3"},{"$f":"IF($J$5=\"Course 1\",Général!E$90,IF($J$5=\"Course 2\",Général!E$92,IF($J$5=\"Course 3\",Général!#REF!,Général!E$94)))","v":"Equipage 2"},{"$f":"IF($K$5=\"Course 1\",Général!E$98,IF($K$5=\"Course 2\",Général!E$100,IF($K$5=\"Course 3\",Général!#REF!,Général!E$102)))","v":"Equipage 7"},{"$f":"IF($L$5=\"Course 1\",Général!E$106,IF($L$5=\"Course 2\",Général!E$108,IF($L$5=\"Course 3\",Général!#REF!,Général!E$110)))","v":"Equipage 7"},{"$f":"IF($M$5=\"Course 1\",Général!E$114,IF($M$5=\"Course 2\",Général!E$116,IF($M$5=\"Course 3\",Général!#REF!,Général!E$118)))","v":"Equipage 4"},{"$f":"IF($N$5=\"Course 1\",Général!E$122,IF($N$5=\"Course 2\",Général!E$124,IF($N$5=\"Course 3\",Général!#REF!,Général!E$126)))","v":"Equipage 2"},{"$f":"IF($O$5=\"Course 1\",Général!E$130,IF($O$5=\"Course 2\",Général!E$132,IF($O$5=\"Course 3\",Général!#REF!,Général!E$134)))","v":"Equipage 1"},{"$f":"IF($P$5=\"Course 1\",Général!E$138,IF($P$5=\"Course 2\",Général!E$140,IF($P$5=\"Course 3\",Général!#REF!,Général!E$142)))","v":"Equipage 4"},{"$f":"IF($Q$5=\"Course 1\",Général!E$146,IF($Q$5=\"Course 2\",Général!E$148,IF($Q$5=\"Course 3\",Général!#REF!,Général!E$150)))","v":"Equipage 6"},{"$f":"IF($R$5=\"Course 1\",Général!E$154,IF($R$5=\"Course 2\",Général!E$156,IF($R$5=\"Course 3\",Général!E$158,Général!E$160)))","v":"Equipage 5"}]
["5ème Equipage",null,{"$f":"IF($C$5=\"Course 1\",Général!F34,IF($C$5=\"Course 2\",Général!F36,IF($C$5=\"Course 3\",Général!#REF!,Général!F38)))","v":"Equipage 2"},{"$f":"IF($D$5=\"Course 1\",Général!F42,IF($D$5=\"Course 2\",Général!F44,IF($D$5=\"Course 3\",Général!#REF!,Général!F46)))","v":"Equipage 7"},{"$f":"IF($E$5=\"Course 1\",Général!F50,IF($E$5=\"Course 2\",Général!F52,IF($E$5=\"Course 3\",Général!#REF!,Général!F54)))","v":"Equipage 6"},{"$f":"IF($F$5=\"Course 1\",Général!F$58,IF($F$5=\"Course 2\",Général!F$60,IF($F$5=\"Course 3\",Général!#REF!,Général!F$62)))","v":"Equipage 6"},{"$f":"IF($G$5=\"Course 1\",Général!F$66,IF($G$5=\"Course 2\",Général!F$68,IF($G$5=\"Course 3\",Général!#REF!,Général!F$70)))","v":"Equipage 7"},{"$f":"IF($H$5=\"Course 1\",Général!F$74,IF($H$5=\"Course 2\",Général!F$76,IF($H$5=\"Course 3\",Général!#REF!,Général!F$78)))","v":"Equipage 1"},{"$f":"IF($I$5=\"Course 1\",Général!F$82,IF($I$5=\"Course 2\",Général!F$84,IF($I$5=\"Course 3\",Général!#REF!,Général!F$86)))","v":"Equipage 2"},{"$f":"IF($J$5=\"Course 1\",Général!F$90,IF($J$5=\"Course 2\",Général!F$92,IF($J$5=\"Course 3\",Général!#REF!,Général!F$94)))","v":"Equipage 8"},{"$f":"IF($K$5=\"Course 1\",Général!F$98,IF($K$5=\"Course 2\",Général!F$100,IF($K$5=\"Course 3\",Général!#REF!,Général!F$102)))","v":"Equipage 10"},{"$f":"IF($L$5=\"Course 1\",Général!F$106,IF($L$5=\"Course 2\",Général!$F108,IF($L$5=\"Course 3\",Général!#REF!,Général!F$110)))","v":"Equipage 2"},{"$f":"IF($M$5=\"Course 1\",Général!F$114,IF($M$5=\"Course 2\",Général!F$116,IF($M$5=\"Course 3\",Général!#REF!,Général!F$118)))","v":"Equipage 3"},{"$f":"IF($N$5=\"Course 1\",Général!F$122,IF($N$5=\"Course 2\",Général!F$124,IF($N$5=\"Course 3\",Général!#REF!,Général!F$126)))","v":"Equipage 3"},{"$f":"IF($O$5=\"Course 1\",Général!F$130,IF($O$5=\"Course 2\",Général!F$132,IF($O$5=\"Course 3\",Général!#REF!,Général!F$134)))","v":"Equipage 9"},{"$f":"IF($P$5=\"Course 1\",Général!F$138,IF($P$5=\"Course 2\",Général!F$140,IF($P$5=\"Course 3\",Général!#REF!,Général!F$142)))","v":"Equipage 3"},{"$f":"IF($Q$5=\"Course 1\",Général!F$146,IF($Q$5=\"Course 2\",Général!F$148,IF($Q$5=\"Course 3\",Général!#REF!,Général!F$150)))","v":"Equipage 3"},{"$f":"IF($R$5=\"Course 1\",Général!F$154,IF($R$5=\"Course 2\",Général!F$156,IF($R$5=\"Course 3\",Général!F$158,Général!F$160)))","v":"Equipage 8"}]
["7ème Equipage",null,{"$f":"IF($C$5=\"Course 1\",Général!H34,IF($C$5=\"Course 2\",Général!H36,IF($C$5=\"Course 3\",Général!#REF!,Général!H38)))","v":0},{"$f":"IF($D$5=\"Course 1\",Général!H42,IF($D$5=\"Course 2\",Général!H44,IF($D$5=\"Course 3\",Général!#REF!,Général!H46)))","v":0},{"$f":"IF($E$5=\"Course 1\",Général!H50,IF($E$5=\"Course 2\",Général!H52,IF($E$5=\"Course 3\",Général!#REF!,Général!H54)))","v":0},{"$f":"IF($F$5=\"Course 1\",Général!H$58,IF($F$5=\"Course 2\",Général!H$60,IF($F$5=\"Course 3\",Général!#REF!,Général!H$62)))","v":0},{"$f":"IF($G$5=\"Course 1\",Général!H$66,IF($G$5=\"Course 2\",Général!H$68,IF($G$5=\"Course 3\",Général!#REF!,Général!H$70)))","v":0},{"$f":"IF($H$5=\"Course 1\",Général!H$74,IF($H$5=\"Course 2\",Général!H$76,IF($H$5=\"Course 3\",Général!#REF!,Général!H$78)))","v":0},{"$f":"IF($I$5=\"Course 1\",Général!H$82,IF($I$5=\"Course 2\",Général!H$84,IF($I$5=\"Course 3\",Général!#REF!,Général!H$86)))","v":0},{"$f":"IF($J$5=\"Course 1\",Général!H$90,IF($J$5=\"Course 2\",Général!H$92,IF($J$5=\"Course 3\",Général!#REF!,Général!H$94)))","v":0},{"$f":"IF($K$5=\"Course 1\",Général!H$98,IF($K$5=\"Course 2\",Général!H$100,IF($K$5=\"Course 3\",Général!#REF!,Général!H$102)))","v":0},{"$f":"IF($L$5=\"Course 1\",Général!H$106,IF($L$5=\"Course 2\",Général!H$108,IF($L$5=\"Course 3\",Général!#REF!,Général!H$110)))","v":0},{"$f":"IF($M$5=\"Course 1\",Général!H$114,IF($M$5=\"Course 2\",Général!H$116,IF($M$5=\"Course 3\",Général!#REF!,Général!H$118)))","v":0},{"$f":"IF($N$5=\"Course 1\",Général!H$122,IF($N$5=\"Course 2\",Général!H$124,IF($N$5=\"Course 3\",Général!#REF!,Général!H$126)))","v":0},{"$f":"IF($O$5=\"Course 1\",Général!H$130,IF($O$5=\"Course 2\",Général!H$132,IF($O$5=\"Course 3\",Général!#REF!,Général!H$134)))","v":0},{"$f":"IF($P$5=\"Course 1\",Général!H$138,IF($P$5=\"Course 2\",Général!H$140,IF($P$5=\"Course 3\",Général!#REF!,Général!H$142)))","v":0},{"$f":"IF($Q$5=\"Course 1\",Général!H$146,IF($Q$5=\"Course 2\",Général!H$148,IF($Q$5=\"Course 3\",Général!#REF!,Général!H$150)))","v":0},{"$f":"IF($R$5=\"Course 1\",Général!H$154,IF($R$5=\"Course 2\",Général!H$156,IF($R$5=\"Course 3\",Général!H$158,Général!H$160)))","v":0},null,null,null,{"$f":"Général!B14","v":"Equipage 14"},{"$f":"COUNTIF($C$8:$R$16,V13)","v":0}]
["8ème Equipage",null,{"$f":"IF($C$5=\"Course 1\",Général!I34,IF($C$5=\"Course 2\",Général!I36,IF($C$5=\"Course 3\",Général!#REF!,Général!I38)))","v":0},{"$f":"IF($D$5=\"Course 1\",Général!I42,IF($D$5=\"Course 2\",Général!I44,IF($D$5=\"Course 3\",Général!#REF!,Général!I46)))","v":0},{"$f":"IF($E$5=\"Course 1\",Général!I50,IF($E$5=\"Course 2\",Général!I52,IF($E$5=\"Course 3\",Général!#REF!,Général!I54)))","v":0},{"$f":"IF($F$5=\"Course 1\",Général!I$58,IF($F$5=\"Course 2\",Général!I$60,IF($F$5=\"Course 3\",Général!#REF!,Général!I$62)))","v":0},{"$f":"IF($G$5=\"Course 1\",Général!I$66,IF($G$5=\"Course 2\",Général!I$68,IF($G$5=\"Course 3\",Général!#REF!,Général!I$70)))","v":0},{"$f":"IF($H$5=\"Course 1\",Général!I$74,IF($H$5=\"Course 2\",Général!I$76,IF($H$5=\"Course 3\",Général!#REF!,Général!I$78)))","v":0},{"$f":"IF($I$5=\"Course 1\",Général!I$82,IF($I$5=\"Course 2\",Général!I$84,IF($I$5=\"Course 3\",Général!#REF!,Général!I$86)))","v":0},{"$f":"IF($J$5=\"Course 1\",Général!I$90,IF($J$5=\"Course 2\",Général!I$92,IF($J$5=\"Course 3\",Général!#REF!,Général!I$94)))","v":0},{"$f":"IF($K$5=\"Course 1\",Général!I$98,IF($K$5=\"Course 2\",Général!I$100,IF($K$5=\"Course 3\",Général!#REF!,Général!I$102)))","v":0},{"$f":"IF($L$5=\"Course 1\",Général!I$106,IF($L$5=\"Course 2\",Général!I$108,IF($L$5=\"Course 3\",Général!#REF!,Général!I$110)))","v":0},{"$f":"IF($M$5=\"Course 1\",Général!I$114,IF($M$5=\"Course 2\",Général!I$116,IF($M$5=\"Course 3\",Général!#REF!,Général!I$118)))","v":0},{"$f":"IF($N$5=\"Course 1\",Général!I$122,IF($N$5=\"Course 2\",Général!I$124,IF($N$5=\"Course 3\",Général!#REF!,Général!I$126)))","v":0},{"$f":"IF($O$5=\"Course 1\",Général!I$130,IF($O$5=\"Course 2\",Général!I$132,IF($O$5=\"Course 3\",Général!#REF!,Général!I$134)))","v":0},{"$f":"IF($P$5=\"Course 1\",Général!I$138,IF($P$5=\"Course 2\",Général!I$140,IF($P$5=\"Course 3\",Général!#REF!,Général!I$142)))","v":0},{"$f":"IF($Q$5=\"Course 1\",Général!I$146,IF($Q$5=\"Course 2\",Général!I$148,IF($Q$5=\"Course 3\",Général!#REF!,Général!I$150)))","v":0},{"$f":"IF($R$5=\"Course 1\",Général!I$154,IF($R$5=\"Course 2\",Général!I$156,IF($R$5=\"Course 3\",Général!I$158,Général!I$160)))","v":0},null,null,null,{"$f":"Général!B15","v":"Equipage 15"},0]
["9ème Equipage",null,{"$f":"IF($C$5=\"Course 1\",Général!J34,IF($C$5=\"Course 2\",Général!J36,IF($C$5=\"Course 3\",Général!#REF!,Général!J38)))","v":0},{"$f":"IF($D$5=\"Course 1\",Général!J42,IF($D$5=\"Course 2\",Général!J44,IF($D$5=\"Course 3\",Général!#REF!,Général!J46)))","v":0},{"$f":"IF($E$5=\"Course 1\",Général!J50,IF($E$5=\"Course 2\",Général!J52,IF($E$5=\"Course 3\",Général!#REF!,Général!J54)))","v":0},{"$f":"IF($F$5=\"Course 1\",Général!J$58,IF($F$5=\"Course 2\",Général!J$60,IF($F$5=\"Course 3\",Général!#REF!,Général!J$62)))","v":0},{"$f":"IF($G$5=\"Course 1\",Général!J$66,IF($G$5=\"Course 2\",Général!J$68,IF($G$5=\"Course 3\",Général!#REF!,Général!J$70)))","v":0},{"$f":"IF($H$5=\"Course 1\",Général!J$74,IF($H$5=\"Course 2\",Général!J$76,IF($H$5=\"Course 3\",Général!#REF!,Général!J$78)))","v":0},{"$f":"IF($I$5=\"Course 1\",Général!J$82,IF($I$5=\"Course 2\",Général!J$84,IF($I$5=\"Course 3\",Général!#REF!,Général!J$86)))","v":0},{"$f":"IF($J$5=\"Course 1\",Général!J$90,IF($J$5=\"Course 2\",Général!J$92,IF($J$5=\"Course 3\",Général!#REF!,Général!J$94)))","v":0},{"$f":"IF($K$5=\"Course 1\",Général!J$98,IF($K$5=\"Course 2\",Général!J$100,IF($K$5=\"Course 3\",Général!#REF!,Général!J$102)))","v":0},{"$f":"IF($L$5=\"Course 1\",Général!J$106,IF($L$5=\"Course 2\",Général!J$108,IF($L$5=\"Course 3\",Général!#REF!,Général!J$110)))","v":0},{"$f":"IF($M$5=\"Course 1\",Général!J$114,IF($M$5=\"Course 2\",Général!J$116,IF($M$5=\"Course 3\",Général!#REF!,Général!J$118)))","v":0},{"$f":"IF($N$5=\"Course 1\",Général!J$122,IF($N$5=\"Course 2\",Général!J$124,IF($N$5=\"Course 3\",Général!#REF!,Général!J$126)))","v":0},{"$f":"IF($O$5=\"Course 1\",Général!J$130,IF($O$5=\"Course 2\",Général!J$132,IF($O$5=\"Course 3\",Général!#REF!,Général!J$134)))","v":0},{"$f":"IF($P$5=\"Course 1\",Général!J$138,IF($P$5=\"Course 2\",Général!J$140,IF($P$5=\"Course 3\",Général!#REF!,Général!J$142)))","v":0},{"$f":"IF($Q$5=\"Course 1\",Général!J$146,IF($Q$5=\"Course 2\",Général!J$148,IF($Q$5=\"Course 3\",Général!#REF!,Général!J$150)))","v":0},{"$f":"IF($R$5=\"Course 1\",Général!J$154,IF($R$5=\"Course 2\",Général!J$156,IF($R$5=\"Course 3\",Général!J$158,Général!J$160)))","v":0},null,null,null,{"$f":"Général!B16","v":"Equipage 16"},0]
["10ème Equipage",null,{"$f":"IF($C$5=\"Course 1\",Général!K34,IF($C$5=\"Course 2\",Général!K36,IF($C$5=\"Course 3\",Général!#REF!,Général!K38)))","v":0},{"$f":"IF($D$5=\"Course 1\",Général!K42,IF($D$5=\"Course 2\",Général!K44,IF($D$5=\"Course 3\",Général!#REF!,Général!K46)))","v":0},{"$f":"IF($E$5=\"Course 1\",Général!K50,IF($E$5=\"Course 2\",Général!K52,IF($E$5=\"Course 3\",Général!#REF!,Général!K54)))","v":0},{"$f":"IF($F$5=\"Course 1\",Général!K$58,IF($F$5=\"Course 2\",Général!K$60,IF($F$5=\"Course 3\",Général!#REF!,Général!K$62)))","v":0},{"$f":"IF($G$5=\"Course 1\",Général!K$66,IF($G$5=\"Course 2\",Général!K$68,IF($G$5=\"Course 3\",Général!#REF!,Général!K$70)))","v":0},{"$f":"IF($H$5=\"Course 1\",Général!K$74,IF($H$5=\"Course 2\",Général!K$76,IF($H$5=\"Course 3\",Général!#REF!,Général!K$78)))","v":0},{"$f":"IF($I$5=\"Course 1\",Général!K$82,IF($I$5=\"Course 2\",Général!K$84,IF($I$5=\"Course 3\",Général!#REF!,Général!K$86)))","v":0},{"$f":"IF($J$5=\"Course 1\",Général!K$90,IF($J$5=\"Course 2\",Général!K$92,IF($J$5=\"Course 3\",Général!#REF!,Général!K$94)))","v":0},{"$f":"IF($K$5=\"Course 1\",Général!K$98,IF($K$5=\"Course 2\",Général!K$100,IF($K$5=\"Course 3\",Général!#REF!,Général!K$102)))","v":0},{"$f":"IF($L$5=\"Course 1\",Général!K$106,IF($L$5=\"Course 2\",Général!K$108,IF($L$5=\"Course 3\",Général!#REF!,Général!K$110)))","v":0},{"$f":"IF($M$5=\"Course 1\",Général!K$114,IF($M$5=\"Course 2\",Général!K$116,IF($M$5=\"Course 3\",Général!#REF!,Général!K$118)))","v":0},{"$f":"IF($N$5=\"Course 1\",Général!K$122,IF($N$5=\"Course 2\",Général!K$124,IF($N$5=\"Course 3\",Général!#REF!,Général!K$126)))","v":0},{"$f":"IF($O$5=\"Course 1\",Général!K$130,IF($O$5=\"Course 2\",Général!K$132,IF($O$5=\"Course 3\",Général!#REF!,Général!K$134)))","v":0},{"$f":"IF($P$5=\"Course 1\",Général!K$138,IF($P$5=\"Course 2\",Général!K$140,IF($P$5=\"Course 3\",Général!#REF!,Général!K$142)))","v":0},{"$f":"IF($Q$5=\"Course 1\",Général!K$146,IF($Q$5=\"Course 2\",Général!K$148,IF($Q$5=\"Course 3\",Général!#REF!,Général!K$150)))","v":0},{"$f":"IF($R$5=\"Course 1\",Général!K$154,IF($R$5=\"Course 2\",Général!K$156,IF($R$5=\"Course 3\",Général!K$158,Général!K$160)))","v":0},null,null,null,{"$f":"Général!B17","v":"Equipage 17"},0]
[null,null,null,null,null,null,null,null,null,null,null,null,null,null,null,null,null,null,null,null,null,{"$f":"Général!B18","v":"Equipage 18"},0]
[null,null,null,null,null,null,null,null,null,null,null,null,null,null,null,null,null,null,null,null,null,{"$f":"Général!B19","v":"Equipage 19"},0]
[null,null,null,null,null,null,null,null,null,null,null,null,null,null,null,null,null,null,null,null,null,{"$f":"Général!B20","v":"Equipage 20"},0]
[null,null,null,null,null,null,null,null,null,null,null,null,null,null,null,null,null,null,null,null,null,{"$f":"Général!B21","v":"Equipage 21"},0]
[null,null,null,null,null,null,null,null,null,null,null,null,null,null,null,null,null,null,null,null,null,{"$f":"Général!B22","v":"Equipage 22"},0]
[null,null,null,null,null,null,null,null,null,null,null,null,null,null,null,null,null,null,null,null,null,{"$f":"Général!B23","v":"Equipage 23"},0]
[null,null,null,null,null,null,null,null,null,null,null,null,null,null,null,null,null,null,null,null,null,{"$f":"Général!B24","v":"Equipage 24"},0]
[null,null,null,null,null,null,null,null,null,null,null,null,null,null,null,null,null,null,null,null,null,{"$f":"Général!B25","v":"Equipage 25"},0]
[null,null,null,null,null,null,null,null,null,null,null,null,null,null,null,null,null,null,null,null,null,{"$f":"Général!B26","v":"Equipage 26"},0]
[null,null,null,null,null,null,null,null,null,null,null,null,null,null,null,null,null,null,null,null,null,{"$f":"Général!B27","v":"Equipage 27"},0]
[null,null,null,null,null,null,null,null,null,null,null,null,null,null,null,null,null,null,null,null,null,{"$f":"Général!B28","v":"Equipage 28"},0]
[null,null,null,null,null,null,null,null,null,null,null,null,null,null,null,null,null,null,null,null,null,{"$f":"Général!B29","v":"Equipage 29"},0]
[null,null,null,null,null,null,null,null,null,null,null,null,null,null,null,null,null,null,null,null,null,{"$f":"Général!B30","v":"Equipage 30"},0]

{"sheet":"Eq.4","index":9,"n_rows":29,"n_cols":23,"rows_kept":29,"cut":false,"hidden":true,"merged":[[7,0,7,1],[0,0,1,5],[0,6,1,10],[3,0,3,1],[4,0,4,1],[5,0,5,1],[14,0,14,1],[15,0,15,1],[8,0,8,1],[9,0,9,1],[10,0,10,1],[11,0,11,1],[12,0,12,1],[13,0,13,1]]}
["Equipage ",null,null,null,null,null,{"$f":"Général!B6","v":"Equipage 4"},null,null,null,null,null,null,null,null,null,null,null,null,null,null,{"$f":"Général!B3","v":"Equipage 1"},{"$f":"COUNTIF(C$8:R$16,V1)","v":10}]
[null,null,null,null,null,null,null,null,null,null,null,null,null,null,null,null,null,null,null,null,null,{"$f":"Général!B4","v":"Equipage 2"},{"$f":"COUNTIF($C$8:$R$16,V2)","v":3}]
[null,null,null,null,null,null,null,null,null,null,null,null,null,null,null,null,null,null,null,null,null,{"$f":"Général!B5","v":"Equipage 3"},2]
[null,null,"FLIGHT 1","FLIGHT 2","FLIGHT 3","FLIGHT 4","FLIGHT 5","FLIGHT 6","FLIGHT 7","FLIGHT 8","FLIGHT 9","FLIGHT 10","FLIGHT 11","FLIGHT 12","FLIGHT 13","FLIGHT 14","FLIGHT 15","FLIGHT 16","FLIGHT 17","FLIGHT 18",null,{"$f":"Général!B6","v":"Equipage 4"},16]
["N° de course",null,{"$f":"IF(COUNTIF(Général!B34:K34,$G$1)=1,\"Course 1\",IF(COUNTIF(Général!B36:K36,$G$1)=1,\"Course 2\",IF(COUNTIF(Général!#REF!,$G$1)=1,\"Course 3\",\"Course 4\")))","v":"Course 1"},{"$f":"IF(COUNTIF(Général!B42:K42,$G$1)=1,\"Course 1\",IF(COUNTIF(Général!B44:K44,$G$1)=1,\"Course 2\",IF(COUNTIF(Général!#REF!,$G$1)=1,\"Course 3\",\"Course 4\")))","v":"Course 1"},{"$f":"IF(COUNTIF(Général!B50:K50,$G$1)=1,\"Course 1\",IF(COUNTIF(Général!B52:K52,$G$1)=1,\"Course 2\",IF(COUNTIF(Général!#REF!,$G$1)=1,\"Course 3\",\"Course 4\")))","v":"Course 1"},{"$f":"IF(COUNTIF(Général!B58:K58,$G$1)=1,\"Course 1\",IF(COUNTIF(Général!B60:K60,$G$1)=1,\"Course 2\",IF(COUNTIF(Général!#REF!,$G$1)=1,\"Course 3\",\"Course 4\")))","v":"Course 2"},{"$f":"IF(COUNTIF(Général!B66:K66,$G$1)=1,\"Course 1\",IF(COUNTIF(Général!B68:K68,$G$1)=1,\"Course 2\",IF(COUNTIF(Général!#REF!,$G$1)=1,\"Course 3\",\"Course 4\")))","v":"Course 2"},{"$f":"IF(COUNTIF(Général!B74:K74,$G$1)=1,\"Course 1\",IF(COUNTIF(Général!B76:K76,$G$1)=1,\"Course 2\",IF(COUNTIF(Général!#REF!,$G$1)=1,\"Course 3\",\"Course 4\")))","v":"Course 2"},{"$f":"IF(COUNTIF(Général!B82:K82,$G$1)=1,\"Course 1\",IF(COUNTIF(Général!B84:K84,$G$1)=1,\"Course 2\",IF(COUNTIF(Général!#REF!,$G$1)=1,\"Course 3\",\"Course 4\")))","v":"Course 1"},{"$f":"IF(COUNTIF(Général!B90:K90,$G$1)=1,\"Course 1\",IF(COUNTIF(Général!B92:K92,$G$1)=1,\"Course 2\",IF(COUNTIF(Général!#REF!,$G$1)=1,\"Course 3\",\"Course 4\")))","v":"Course 1"},{"$f":"IF(COUNTIF(Général!B98:K98,$G$1)=1,\"Course 1\",IF(COUNTIF(Général!B100:K100,$G$1)=1,\"Course 2\",IF(COUNTIF(Général!#REF!,$G$1)=1,\"Course 3\",\"Course 4\")))","v":"Course 1"},{"$f":"IF(COUNTIF(Général!B106:K106,$G$1)=1,\"Course 1\",IF(COUNTIF(Général!B108:K108,$G$1)=1,\"Course 2\",IF(COUNTIF(Général!#REF!,$G$1)=1,\"Course 3\",\"Course 4\")))","v":"Course 2"},{"$f":"IF(COUNTIF(Général!B114:K114,$G$1)=1,\"Course 1\",IF(COUNTIF(Général!B116:K116,$G$1)=1,\"Course 2\",IF(COUNTIF(Général!#REF!,$G$1)=1,\"Course 3\",\"Course 4\")))","v":"Course 2"},{"$f":"IF(COUNTIF(Général!B122:K122,$G$1)=1,\"Course 1\",IF(COUNTIF(Général!B124:K124,$G$1)=1,\"Course 2\",IF(COUNTIF(Général!#REF!,$G$1)=1,\"Course 3\",\"Course 4\")))","v":"Course 2"},{"$f":"IF(COUNTIF(Général!B130:K130,$G$1)=1,\"Course 1\",IF(COUNTIF(Général!B132:K132,$G$1)=1,\"Course 2\",IF(COUNTIF(Général!#REF!,$G$1)=1,\"Course 3\",\"Course 4\")))","v":"Course 2"},{"$f":"IF(COUNTIF(Général!B138:K138,$G$1)=1,\"Course 1\",IF(COUNTIF(Général!B140:K140,$G$1)=1,\"Course 2\",IF(COUNTIF(Général!#REF!,$G$1)=1,\"Course 3\",\"Course 4\")))","v":"Course 2"},{"$f":"IF(COUNTIF(Général!B146:K146,$G$1)=1,\"Course 1\",IF(COUNTIF(Général!B148:K148,$G$1)=1,\"Course 2\",IF(COUNTIF(Général!#REF!,$G$1)=1,\"Course 3\",\"Course 4\")))","v":"Course 1"},{"$f":"IF(COUNTIF(Général!B154:K154,$G$1)=1,\"Course 1\",IF(COUNTIF(Général!B156:K156,$G$1)=1,\"Course 2\",IF(COUNTIF(Général!B158:K158,$G$1)=1,\"Course 3\",\"Course 4\")))","v":"Course 1"},{"$f":"IF(COUNTIF(Général!C154:L154,$G$1)=1,\"Course 1\",IF(COUNTIF(Général!C156:L156,$G$1)=1,\"Course 2\",IF(COUNTIF(Général!C158:L158,$G$1)=1,\"Course 3\",\"Course 4\")))","v":"Course 1"},{"$f":"IF(COUNTIF(Général!D154:M154,$G$1)=1,\"Course 1\",IF(COUNTIF(Général!D156:M156,$G$1)=1,\"Course 2\",IF(COUNTIF(Général!D158:M158,$G$1)=1,\"Course 3\",\"Course 4\")))","v":"Course 1"},null,{"$f":"Général!B7","v":"Equipage 5"},9]
["Bateau",null,{"$f":"IF(COUNTIF(Général!B34:B38,$G$1)=1,\"Boat 1\",IF(COUNTIF(Général!C34:C38,$G$1)=1,\"Boat 2\",IF(COUNTIF(Général!D34:D38,$G$1)=1,\"Boat 3\",IF(COUNTIF(Général!E34:E38,$G$1)=1,\"Boat 4\",IF(COUNTIF(Général!F34:F38,$G$1)=1,\"Boat 5\",IF(COUNTIF(Général!G34:G38,$G$1)=1,\"Boat 6\",IF(COUNTIF(Général!H34:H38,$G$1)=1,\"Boat 7\",IF(COUNTIF(Général!I34:I38,$G$1)=1,\"Boat 8\",IF(COUNTIF(Général!J34:J38,$G$1)=1,\"Boat 9\",\"Boat10\")))))))))","v":"Boat 3"},{"$f":"IF(COUNTIF(Général!B42:B46,$G$1)=1,\"Boat 1\",IF(COUNTIF(Général!C42:C46,$G$1)=1,\"Boat 2\",IF(COUNTIF(Général!D42:D46,$G$1)=1,\"Boat 3\",IF(COUNTIF(Général!E42:E46,$G$1)=1,\"Boat 4\",IF(COUNTIF(Général!F42:F46,$G$1)=1,\"Boat 5\",IF(COUNTIF(Général!G42:G46,$G$1)=1,\"Boat 6\",IF(COUNTIF(Général!H42:H46,$G$1)=1,\"Boat 7\",IF(COUNTIF(Général!I42:I46,$G$1)=1,\"Boat 8\",IF(COUNTIF(Général!J42:J46,$G$1)=1,\"Boat 9\",\"Boat 10\")))))))))","v":"Boat 2"},{"$f":"IF(COUNTIF(Général!B50:B54,$G$1)=1,\"Boat 1\",IF(COUNTIF(Général!C50:C54,$G$1)=1,\"Boat 2\",IF(COUNTIF(Général!D50:D54,$G$1)=1,\"Boat 3\", IF(COUNTIF(Général!E50:E54,$G$1)=1,\"Boat 4\", IF(COUNTIF(Général!F50:F54,$G$1)=1,\"Boat 5\", IF(COUNTIF(Général!G50:G54,$G$1)=1,\"Boat 6\", IF(COUNTIF(Général!H50:H54,$G$1)=1,\"Boat 7\",IF(COUNTIF(Général!I50:I54,$G$1)=1,\"Boat 8\",IF(COUNTIF(Général!J50:J54,$G$1)=1,\"Boat 9\",\"Boat 10\")))))))))","v":"Boat 3"},{"$f":"IF(COUNTIF(Général!B58:B62,$G$1)=1,\"Boat 1\",IF(COUNTIF(Général!C58:C62,$G$1)=1,\"Boat 2\",IF(COUNTIF(Général!D58:D62,$G$1)=1,\"Boat 3\", IF(COUNTIF(Général!E58:E62,$G$1)=1,\"Boat 4\", IF(COUNTIF(Général!F58:F62,$G$1)=1,\"Boat 5\", IF(COUNTIF(Général!G58:G62,$G$1)=1,\"Boat 6\", IF(COUNTIF(Général!H58:H62,$G$1)=1,\"Boat 7\",IF(COUNTIF(Général!I58:I62,$G$1)=1,\"Boat 8\",IF(COUNTIF(Général!I58:J62,$G$1)=1,\"Boat 9\",\"Boat 10\")))))))))","v":"Boat 2"},{"$f":"IF(COUNTIF(Général!B66:B70,$G$1)=1,\"Boat 1\",IF(COUNTIF(Général!C66:C70,$G$1)=1,\"Boat 2\",IF(COUNTIF(Général!D66:D70,$G$1)=1,\"Boat 3\", IF(COUNTIF(Général!E66:E70,$G$1)=1,\"Boat 4\", IF(COUNTIF(Général!F66:F70,$G$1)=1,\"Boat 5\", IF(COUNTIF(Général!G66:G70,$G$1)=1,\"Boat 6\", IF(COUNTIF(Général!H66:H70,$G$1)=1,\"Boat 7\",IF(COUNTIF(Général!I66:I70,$G$1)=1,\"Boat 8\",IF(COUNTIF(Général!J66:J70,$G$1)=1,\"Boat 9\",\"Boat 10\")))))))))","v":"Boat 1"},{"$f":"IF(COUNTIF(Général!B74:B78,$G$1)=1,\"Boat 1\",IF(COUNTIF(Général!C74:C78,$G$1)=1,\"Boat 2\",IF(COUNTIF(Général!D74:D78,$G$1)=1,\"Boat 3\", IF(COUNTIF(Général!E74:E78,$G$1)=1,\"Boat 4\", IF(COUNTIF(Général!F74:F78,$G$1)=1,\"Boat 5\", IF(COUNTIF(Général!G74:G78,$G$1)=1,\"Boat 6\", IF(COUNTIF(Général!H74:H78,$G$1)=1,\"Boat 7\",IF(COUNTIF(Général!I74:I78,$G$1)=1,\"Boat 8\",IF(COUNTIF(Général!J74:J78,$G$1)=1,\"Boat 9\",\"Boat 10\")))))))))","v":"Boat 1"},{"$f":"IF(COUNTIF(Général!B82:B86,$G$1)=1,\"Boat 1\",IF(COUNTIF(Général!C82:C86,$G$1)=1,\"Boat 2\",IF(COUNTIF(Général!D82:D86,$G$1)=1,\"Boat 3\", IF(COUNTIF(Général!E82:E86,$G$1)=1,\"Boat 4\", IF(COUNTIF(Général!F82:F86,$G$1)=1,\"Boat 5\", IF(COUNTIF(Général!G82:G86,$G$1)=1,\"Boat 6\", IF(COUNTIF(Général!H82:H86,$G$1)=1,\"Boat 7\",IF(COUNTIF(Général!I82:I86,$G$1)=1,\"Boat 8\",IF(COUNTIF(Général!J82:J86,$G$1)=1,\"Boat 9\",\"Boat 10\")))))))))","v":"Boat 1"},{"$f":"IF(COUNTIF(Général!B90:B94,$G$1)=1,\"Boat 1\",IF(COUNTIF(Général!C90:C94,$G$1)=1,\"Boat 2\",IF(COUNTIF(Général!D90:D94,$G$1)=1,\"Boat 3\", IF(COUNTIF(Général!E90:E94,$G$1)=1,\"Boat 4\", IF(COUNTIF(Général!F90:F94,$G$1)=1,\"Boat 5\", IF(COUNTIF(Général!G90:G94,$G$1)=1,\"Boat 6\", IF(COUNTIF(Général!H90:H94,$G$1)=1,\"Boat 7\",IF(COUNTIF(Général!I90:I94,$G$1)=1,\"Boat 8\",IF(COUNTIF(Général!J90:J94,$G$1)=1,\"Boat 9\",\"Boat 10\")))))))))","v":"Boat 4"},{"$f":"IF(COUNTIF(Général!B98:B102,$G$1)=1,\"Boat 1\",IF(COUNTIF(Général!C98:C102,$G$1)=1,\"Boat 2\",IF(COUNTIF(Général!D98:D102,$G$1)=1,\"Boat 3\", IF(COUNTIF(Général!E98:E102,$G$1)=1,\"Boat 4\", IF(COUNTIF(Général!F98:F102,$G$1)=1,\"Boat 5\", IF(COUNTIF(Général!G98:G102,$G$1)=1,\"Boat 6\", IF(COUNTIF(Général!H98:H102,$G$1)=1,\"Boat 7\",IF(COUNTIF(Général!I98:I102,$G$1)=1,\"Boat 8\",IF(COUNTIF(Général!J98:J102,$G$1)=1,\"Boat 9\",\"Boat 10\")))))))))","v":"Boat 5"},{"$f":"IF(COUNTIF(Général!B106:B110,$G$1)=1,\"Boat 1\",IF(COUNTIF(Général!C106:C110,$G$1)=1,\"Boat 2\",IF(COUNTIF(Général!D106:D110,$G$1)=1,\"Boat 3\", IF(COUNTIF(Général!E106:E110,$G$1)=1,\"Boat 4\", IF(COUNTIF(Général!F106:F110,$G$1)=1,\"Boat 5\", IF(COUNTIF(Général!G106:G110,$G$1)=1,\"Boat 6\", IF(COUNTIF(Général!H106:H110,$G$1)=1,\"Boat 7\",IF(COUNTIF(Général!I106:I110,$G$1)=1,\"Boat 8\",IF(COUNTIF(Général!J106:J110,$G$1)=1,\"Boat 9\",\"Boat 10\")))))))))","v":"Boat 2"},{"$f":"IF(COUNTIF(Général!B114:B118,$G$1)=1,\"Boat 1\",IF(COUNTIF(Général!C114:C118,$G$1)=1,\"Boat 2\",IF(COUNTIF(Général!C114:D118,$G$1)=1,\"Boat 3\", IF(COUNTIF(Général!C114:E118,$G$1)=1,\"Boat 4\", IF(COUNTIF(Général!F114:F118,$G$1)=1,\"Boat 5\", IF(COUNTIF(Général!G114:G118,$G$1)=1,\"Boat 6\", IF(COUNTIF(Général!H114:H118,$G$1)=1,\"Boat 7\",IF(COUNTIF(Général!I114:I118,$G$1)=1,\"Boat 8\",IF(COUNTIF(Général!J114:J118,$G$1)=1,\"Boat 9\",\"Boat 10\")))))))))","v":"Boat 4"},{"$f":"IF(COUNTIF(Général!B122:B126,$G$1)=1,\"Boat 1\",IF(COUNTIF(Général!C122:C126,$G$1)=1,\"Boat 2\",IF(COUNTIF(Général!D122:D126,$G$1)=1,\"Boat 3\", IF(COUNTIF(Général!E122:E126,$G$1)=1,\"Boat 4\", IF(COUNTIF(Général!F122:F126,$G$1)=1,\"Boat 5\", IF(COUNTIF(Général!G122:G126,$G$1)=1,\"Boat 6\", IF(COUNTIF(Général!H122:H126,$G$1)=1,\"Boat 7\",IF(COUNTIF(Général!I122:I126,$G$1)=1,\"Boat 8\",IF(COUNTIF(Général!J122:J126,$G$1)=1,\"Boat 9\",\"Boat 10\")))))))))","v":"Boat 5"},{"$f":"IF(COUNTIF(Général!B130:B134,$G$1)=1,\"Boat 1\",IF(COUNTIF(Général!C130:C134,$G$1)=1,\"Boat 2\",IF(COUNTIF(Général!D130:D134,$G$1)=1,\"Boat 3\", IF(COUNTIF(Général!E130:E134,$G$1)=1,\"Boat 4\", IF(COUNTIF(Général!F130:F134,$G$1)=1,\"Boat 5\", IF(COUNTIF(Général!G130:G134,$G$1)=1,\"Boat 6\", IF(COUNTIF(Général!H130:H134,$G$1)=1,\"Boat 7\",IF(COUNTIF(Général!I130:I134,$G$1)=1,\"Boat 8\",IF(COUNTIF(Général!J130:J134,$G$1)=1,\"Boat 9\",\"Boat 10\")))))))))","v":"Boat 1"},{"$f":"IF(COUNTIF(Général!B138:B142,$G$1)=1,\"Boat 1\",IF(COUNTIF(Général!C138:C142,$G$1)=1,\"Boat 2\",IF(COUNTIF(Général!D138:D142,$G$1)=1,\"Boat 3\", IF(COUNTIF(Général!E138:E142,$G$1)=1,\"Boat 4\", IF(COUNTIF(Général!F138:F142,$G$1)=1,\"Boat 5\", IF(COUNTIF(Général!G138:G142,$G$1)=1,\"Boat 6\", IF(COUNTIF(Général!H138:H142,$G$1)=1,\"Boat 7\",IF(COUNTIF(Général!I138:I142,$G$1)=1,\"Boat 8\",IF(COUNTIF(Général!J138:J142,$G$1)=1,\"Boat 9\",\"Boat 10\")))))))))","v":"Boat 4"},{"$f":"IF(COUNTIF(Général!B146:B150,$G$1)=1,\"Boat 1\",IF(COUNTIF(Général!C146:C150,$G$1)=1,\"Boat 2\",IF(COUNTIF(Général!D146:D150,$G$1)=1,\"Boat 3\", IF(COUNTIF(Général!E146:E150,$G$1)=1,\"Boat 4\", IF(COUNTIF(Général!F146:F150,$G$1)=1,\"Boat 5\", IF(COUNTIF(Général!G146:G150,$G$1)=1,\"Boat 6\", IF(COUNTIF(Général!H146:H150,$G$1)=1,\"Boat 7\",IF(COUNTIF(Général!I146:I150,$G$1)=1,\"Boat 8\",IF(COUNTIF(Général!J146:J150,$G$1)=1,\"Boat 9\",\"Boat 10\")))))))))","v":"Boat 4"},{"$f":"IF(COUNTIF(Général!B154:B157,$G$1)=1,\"Boat 1\",IF(COUNTIF(Général!C154:C157,$G$1)=1,\"Boat 2\",IF(COUNTIF(Général!D154:D157,$G$1)=1,\"Boat 3\", IF(COUNTIF(Général!E154:E157,$G$1)=1,\"Boat 4\", IF(COUNTIF(Général!F154:F157,$G$1)=1,\"Boat 5\", IF(COUNTIF(Général!G154:G157,$G$1)=1,\"Boat 6\", IF(COUNTIF(Général!H154:H157,$G$1)=1,\"Boat 7\",IF(COUNTIF(Général!I154:I157,$G$1)=1,\"Boat 8\",IF(COUNTIF(Général!J154:J157,$G$1)=1,\"Boat 9\",\"Boat 10\")))))))))","v":"Boat 5"},{"$f":"IF(COUNTIF(Général!B160:B163,$G$1)=1,\"Boat 1\",IF(COUNTIF(Général!C160:C163,$G$1)=1,\"Boat 2\",IF(COUNTIF(Général!D160:D163,$G$1)=1,\"Boat 3\", IF(COUNTIF(Général!E160:E163,$G$1)=1,\"Boat 4\", IF(COUNTIF(Général!F160:F163,$G$1)=1,\"Boat 5\", IF(COUNTIF(Général!G160:G163,$G$1)=1,\"Boat 6\", IF(COUNTIF(Général!H160:H163,$G$1)=1,\"Boat 7\",IF(COUNTIF(Général!I160:I163,$G$1)=1,\"Boat 8\",IF(COUNTIF(Général!J160:J163,$G$1)=1,\"Boat 9\",\"Boat 10\")))))))))","v":"Boat 5"},{"$f":"IF(COUNTIF(Général!B166:B169,$G$1)=1,\"Boat 1\",IF(COUNTIF(Général!C166:C169,$G$1)=1,\"Boat 2\",IF(COUNTIF(Général!D166:D169,$G$1)=1,\"Boat 3\", IF(COUNTIF(Général!E166:E169,$G$1)=1,\"Boat 4\", IF(COUNTIF(Général!F166:F169,$G$1)=1,\"Boat 5\", IF(COUNTIF(Général!G166:G169,$G$1)=1,\"Boat 6\", IF(COUNTIF(Général!H166:H169,$G$1)=1,\"Boat 7\",IF(COUNTIF(Général!I166:I169,$G$1)=1,\"Boat 8\",IF(COUNTIF(Général!J166:J169,$G$1)=1,\"Boat 9\",\"Boat 10\")))))))))","v":"Boat 5"},null,{"$f":"Général!B8","v":"Equipage 6"},6]
[null,null,null,null,null,null,null,null,null,null,null,null,null,null,null,null,null,null,null,null,null,{"$f":"Général!B9","v":"Equipage 7"},9]
["1er Equipage",null,{"$f":"IF($C$5=\"Course 1\",Général!B34,IF($C$5=\"Course 2\",Général!B36,IF($C$5=\"Course 3\",Général!#REF!,Général!B38)))","v":"Equipage 7"},{"$f":"IF($D$5=\"Course 1\",Général!B42,IF($D$5=\"Course 2\",Général!B44,IF($D$5=\"Course 3\",Général!#REF!,Général!B46)))","v":"Equipage 8"},{"$f":"IF($E$5=\"Course 1\",Général!B50,IF($E$5=\"Course 2\",Général!B52,IF($E$5=\"Course 3\",Général!#REF!,Général!B54)))","v":"Equipage 5"},{"$f":"IF($F$5=\"Course 1\",Général!B$58,IF($F$5=\"Course 2\",Général!B$60,IF($F$5=\"Course 3\",Général!#REF!,Général!B$62)))","v":"Equipage 2"},{"$f":"IF($G$5=\"Course 1\",Général!B$66,IF($G$5=\"Course 2\",Général!B$68,IF($G$5=\"Course 3\",Général!#REF!,Général!B$70)))","v":"Equipage 4"},{"$f":"IF($H$5=\"Course 1\",Général!B$74,IF($H$5=\"Course 2\",Général!B$76,IF($H$5=\"Course 3\",Général!#REF!,Général!B$78)))","v":"Equipage 4"},{"$f":"IF($I$5=\"Course 1\",Général!B$82,IF($I$5=\"Course 2\",Général!B$84,IF($I$5=\"Course 3\",Général!#REF!,Général!B$86)))","v":"Equipage 4"},{"$f":"IF($J$5=\"Course 1\",Général!B$90,IF($J$5=\"Course 2\",Général!B$92,IF($J$5=\"Course 3\",Général!#REF!,Général!B$94)))","v":"Equipage 6"},{"$f":"IF($K$5=\"Course 1\",Général!B$98,IF($K$5=\"Course 2\",Général!B$100,IF($K$5=\"Course 3\",Général!#REF!,Général!B$102)))","v":"Equipage 6"},{"$f":"IF($L$5=\"Course 1\",Général!B$106,IF($L$5=\"Course 2\",Général!B$108,IF($L$5=\"Course 3\",Général!#REF!,Général!B$110)))","v":"Equipage 10"},{"$f":"IF($M$5=\"Course 1\",Général!B$114,IF($M$5=\"Course 2\",Général!B$116,IF($M$5=\"Course 3\",Général!#REF!,Général!B$118)))","v":"Equipage 1"},{"$f":"IF($N$5=\"Course 1\",Général!B$122,IF($N$5=\"Course 2\",Général!B$124,IF($N$5=\"Course 3\",Général!#REF!,Général!B$126)))","v":"Equipage 8"},{"$f":"IF($O$5=\"Course 1\",Général!B$130,IF($O$5=\"Course 2\",Général!B$132,IF($O$5=\"Course 3\",Général!#REF!,Général!B$134)))","v":"Equipage 4"},{"$f":"IF($P$5=\"Course 1\",Général!B$138,IF($P$5=\"Course 2\",Général!B$140,IF($P$5=\"Course 3\",Général!#REF!,Général!B$142)))","v":"Equipage 7"},{"$f":"IF($Q$5=\"Course 1\",Général!B$146,IF($Q$5=\"Course 2\",Général!B$148,IF($Q$5=\"Course 3\",Général!#REF!,Général!B$150)))","v":"Equipage 8"},{"$f":"IF($R$5=\"Course 1\",Général!B$154,IF($R$5=\"Course 2\",Général!B$156,IF($R$5=\"Course 3\",Général!B$158,Général!B$160)))","v":"Equipage 1"},null,null,null,{"$f":"Général!B10","v":"Equipage 8"},9]
["2nd Equipage",null,{"$f":"IF($C$5=\"Course 1\",Général!C34,IF($C$5=\"Course 2\",Général!C36,IF($C$5=\"Course 3\",Général!#REF!,Général!C38)))","v":"Equipage 10"},{"$f":"IF($D$5=\"Course 1\",Général!C42,IF($D$5=\"Course 2\",Général!C44,IF($D$5=\"Course 3\",Général!#REF!,Général!C46)))","v":"Equipage 4"},{"$f":"IF($E$5=\"Course 1\",Général!C50,IF($E$5=\"Course 2\",Général!C52,IF($E$5=\"Course 3\",Général!#REF!,Général!C54)))","v":"Equipage 8"},{"$f":"IF($F$5=\"Course 1\",Général!C$58,IF($F$5=\"Course 2\",Général!C$60,IF($F$5=\"Course 3\",Général!#REF!,Général!C$62)))","v":"Equipage 4"},{"$f":"IF($G$5=\"Course 1\",Général!C$66,IF($G$5=\"Course 2\",Général!C$68,IF($G$5=\"Course 3\",Général!#REF!,Général!C$70)))","v":"Equipage 10"},{"$f":"IF($H$5=\"Course 1\",Général!C$74,IF($H$5=\"Course 2\",Général!C$76,IF($H$5=\"Course 3\",Général!#REF!,Général!C$78)))","v":"Equipage 8"},{"$f":"IF($I$5=\"Course 1\",Général!C$82,IF($I$5=\"Course 2\",Général!C$84,IF($I$5=\"Course 3\",Général!#REF!,Général!C$86)))","v":"Equipage 8"},{"$f":"IF($J$5=\"Course 1\",Général!C$90,IF($J$5=\"Course 2\",Général!C$92,IF($J$5=\"Course 3\",Général!#REF!,Général!C$94)))","v":"Equipage 9"},{"$f":"IF($K$5=\"Course 1\",Général!C$98,IF($K$5=\"Course 2\",Général!C$100,IF($K$5=\"Course 3\",Général!#REF!,Général!C$102)))","v":"Equipage 1"},{"$f":"IF($L$5=\"Course 1\",Général!C$106,IF($L$5=\"Course 2\",Général!C$108,IF($L$5=\"Course 3\",Général!#REF!,Général!C$110)))","v":"Equipage 4"},{"$f":"IF($M$5=\"Course 1\",Général!C$114,IF($M$5=\"Course 2\",Général!C$116,IF($M$5=\"Course 3\",Général!#REF!,Général!C$118)))","v":"Equipage 7"},{"$f":"IF($N$5=\"Course 1\",Général!C$122,IF($N$5=\"Course 2\",Général!C$124,IF($N$5=\"Course 3\",Général!#REF!,Général!C$126)))","v":"Equipage 5"},{"$f":"IF($O$5=\"Course 1\",Général!C$130,IF($O$5=\"Course 2\",Général!C$132,IF($O$5=\"Course 3\",Général!#REF!,Général!C$134)))","v":"Equipage 7"},{"$f":"IF($P$5=\"Course 1\",Général!C$138,IF($P$5=\"Course 2\",Général!C$140,IF($P$5=\"Course 3\",Général!#REF!,Général!C$142)))","v":"Equipage 1"},{"$f":"IF($Q$5=\"Course 1\",Général!C$146,IF($Q$5=\"Course 2\",Général!C$148,IF($Q$5=\"Course 3\",Général!#REF!,Général!C$150)))","v":"Equipage 1"},{"$f":"IF($R$5=\"Course 1\",Général!C$154,IF($R$5=\"Course 2\",Général!C$156,IF($R$5=\"Course 3\",Général!C$158,Général!C$160)))","v":"Equipage 7"},null,null,null,{"$f":"Général!B11","v":"Equipage 9"},5]
["3ème Equipage",null,{"$f":"IF($C$5=\"Course 1\",Général!D34,IF($C$5=\"Course 2\",Général!D36,IF($C$5=\"Course 3\",Général!#REF!,Général!D38)))","v":"Equipage 4"},{"$f":"IF($D$5=\"Course 1\",Général!D42,IF($D$5=\"Course 2\",Général!D44,IF($D$5=\"Course 3\",Général!#REF!,Général!D46)))","v":"Equipage 9"},{"$f":"IF($E$5=\"Course 1\",Général!D50,IF($E$5=\"Course 2\",Général!D52,IF($E$5=\"Course 3\",Général!#REF!,Général!D54)))","v":"Equipage 4"},{"$f":"IF($F$5=\"Course 1\",Général!D$58,IF($F$5=\"Course 2\",Général!D$60,IF($F$5=\"Course 3\",Général!#REF!,Général!D$62)))","v":"Equipage 8"},{"$f":"IF($G$5=\"Course 1\",Général!D$66,IF($G$5=\"Course 2\",Général!D$68,IF($G$5=\"Course 3\",Général!#REF!,Général!D$70)))","v":"Equipage 8"},{"$f":"IF($H$5=\"Course 1\",Général!D$74,IF($H$5=\"Course 2\",Général!D$76,IF($H$5=\"Course 3\",Général!#REF!,Général!D$78)))","v":"Equipage 9"},{"$f":"IF($I$5=\"Course 1\",Général!D$82,IF($I$5=\"Course 2\",Général!D$84,IF($I$5=\"Course 3\",Général!#REF!,Général!D$86)))","v":"Equipage 7"},{"$f":"IF($J$5=\"Course 1\",Général!D$90,IF($J$5=\"Course 2\",Général!D$92,IF($J$5=\"Course 3\",Général!#REF!,Général!D$94)))","v":"Equipage 5"},{"$f":"IF($K$5=\"Course 1\",Général!D$98,IF($K$5=\"Course 2\",Général!D$100,IF($K$5=\"Course 3\",Général!#REF!,Général!D$102)))","v":"Equipage 9"},{"$f":"IF($L$5=\"Course 1\",Général!D$106,IF($L$5=\"Course 2\",Général!D$108,IF($L$5=\"Course 3\",Général!#REF!,Général!D$110)))","v":"Equipage 1"},{"$f":"IF($M$5=\"Course 1\",Général!D$114,IF($M$5=\"Course 2\",Général!D$116,IF($M$5=\"Course 3\",Général!#REF!,Général!D$118)))","v":"Equipage 10"},{"$f":"IF($N$5=\"Course 1\",Général!D$122,IF($N$5=\"Course 2\",Général!D$124,IF($N$5=\"Course 3\",Général!#REF!,Général!D$126)))","v":"Equipage 7"},{"$f":"IF($O$5=\"Course 1\",Général!D$130,IF($O$5=\"Course 2\",Général!D$132,IF($O$5=\"Course 3\",Général!#REF!,Général!D$134)))","v":"Equipage 6"},{"$f":"IF($P$5=\"Course 1\",Général!D$138,IF($P$5=\"Course 2\",Général!D$140,IF($P$5=\"Course 3\",Général!#REF!,Général!D$142)))","v":"Equipage 10"},{"$f":"IF($Q$5=\"Course 1\",Général!D$146,IF($Q$5=\"Course 2\",Général!D$148,IF($Q$5=\"Course 3\",Général!#REF!,Général!D$150)))","v":"Equipage 2"},{"$f":"IF($R$5=\"Course 1\",Général!D$154,IF($R$5=\"Course 2\",Général!D$156,IF($R$5=\"Course 3\",Général!D$158,Général!D$160)))","v":"Equipage 10"},null,null,null,{"$f":"Général!B12","v":"Equipage 10"},11]
["4ème Equipage",null,{"$f":"IF($C$5=\"Course 1\",Général!E34,IF($C$5=\"Course 2\",Général!E36,IF($C$5=\"Course 3\",Général!#REF!,Général!E38)))","v":"Equipage 6"},{"$f":"IF($D$5=\"Course 1\",Général!E42,IF($D$5=\"Course 2\",Général!E44,IF($D$5=\"Course 3\",Général!#REF!,Général!E46)))","v":"Equipage 10"},{"$f":"IF($E$5=\"Course 1\",Général!E50,IF($E$5=\"Course 2\",Général!E52,IF($E$5=\"Course 3\",Général!#REF!,Général!E54)))","v":"Equipage 10"},{"$f":"IF($F$5=\"Course 1\",Général!E$58,IF($F$5=\"Course 2\",Général!E$60,IF($F$5=\"Course 3\",Général!#REF!,Général!E$62)))","v":"Equipage 5"},{"$f":"IF($G$5=\"Course 1\",Général!E$66,IF($G$5=\"Course 2\",Général!E$68,IF($G$5=\"Course 3\",Général!#REF!,Général!E$70)))","v":"Equipage 5"},{"$f":"IF($H$5=\"Course 1\",Général!E$74,IF($H$5=\"Course 2\",Général!E$76,IF($H$5=\"Course 3\",Général!#REF!,Général!E$78)))","v":"Equipage 10"},{"$f":"IF($I$5=\"Course 1\",Général!E$82,IF($I$5=\"Course 2\",Général!E$84,IF($I$5=\"Course 3\",Général!#REF!,Général!E$86)))","v":"Equipage 10"},{"$f":"IF($J$5=\"Course 1\",Général!E$90,IF($J$5=\"Course 2\",Général!E$92,IF($J$5=\"Course 3\",Général!#REF!,Général!E$94)))","v":"Equipage 4"},{"$f":"IF($K$5=\"Course 1\",Général!E$98,IF($K$5=\"Course 2\",Général!E$100,IF($K$5=\"Course 3\",Général!#REF!,Général!E$102)))","v":"Equipage 2"},{"$f":"IF($L$5=\"Course 1\",Général!E$106,IF($L$5=\"Course 2\",Général!E$108,IF($L$5=\"Course 3\",Général!#REF!,Général!E$110)))","v":"Equipage 8"},{"$f":"IF($M$5=\"Course 1\",Général!E$114,IF($M$5=\"Course 2\",Général!E$116,IF($M$5=\"Course 3\",Général!#REF!,Général!E$118)))","v":"Equipage 4"},{"$f":"IF($N$5=\"Course 1\",Général!E$122,IF($N$5=\"Course 2\",Général!E$124,IF($N$5=\"Course 3\",Général!#REF!,Général!E$126)))","v":"Equipage 1"},{"$f":"IF($O$5=\"Course 1\",Général!E$130,IF($O$5=\"Course 2\",Général!E$132,IF($O$5=\"Course 3\",Général!#REF!,Général!E$134)))","v":"Equipage 5"},{"$f":"IF($P$5=\"Course 1\",Général!E$138,IF($P$5=\"Course 2\",Général!E$140,IF($P$5=\"Course 3\",Général!#REF!,Général!E$142)))","v":"Equipage 4"},{"$f":"IF($Q$5=\"Course 1\",Général!E$146,IF($Q$5=\"Course 2\",Général!E$148,IF($Q$5=\"Course 3\",Général!#REF!,Général!E$150)))","v":"Equipage 4"},{"$f":"IF($R$5=\"Course 1\",Général!E$154,IF($R$5=\"Course 2\",Général!E$156,IF($R$5=\"Course 3\",Général!E$158,Général!E$160)))","v":"Equipage 6"}]
["5ème Equipage",null,{"$f":"IF($C$5=\"Course 1\",Général!F34,IF($C$5=\"Course 2\",Général!F36,IF($C$5=\"Course 3\",Général!#REF!,Général!F38)))","v":"Equipage 1"},{"$f":"IF($D$5=\"Course 1\",Général!F42,IF($D$5=\"Course 2\",Général!F44,IF($D$5=\"Course 3\",Général!#REF!,Général!F46)))","v":"Equipage 6"},{"$f":"IF($E$5=\"Course 1\",Général!F50,IF($E$5=\"Course 2\",Général!F52,IF($E$5=\"Course 3\",Général!#REF!,Général!F54)))","v":"Equipage 7"},{"$f":"IF($F$5=\"Course 1\",Général!F$58,IF($F$5=\"Course 2\",Général!F$60,IF($F$5=\"Course 3\",Général!#REF!,Général!F$62)))","v":"Equipage 1"},{"$f":"IF($G$5=\"Course 1\",Général!F$66,IF($G$5=\"Course 2\",Général!F$68,IF($G$5=\"Course 3\",Général!#REF!,Général!F$70)))","v":"Equipage 1"},{"$f":"IF($H$5=\"Course 1\",Général!F$74,IF($H$5=\"Course 2\",Général!F$76,IF($H$5=\"Course 3\",Général!#REF!,Général!F$78)))","v":"Equipage 5"},{"$f":"IF($I$5=\"Course 1\",Général!F$82,IF($I$5=\"Course 2\",Général!F$84,IF($I$5=\"Course 3\",Général!#REF!,Général!F$86)))","v":"Equipage 5"},{"$f":"IF($J$5=\"Course 1\",Général!F$90,IF($J$5=\"Course 2\",Général!F$92,IF($J$5=\"Course 3\",Général!#REF!,Général!F$94)))","v":"Equipage 7"},{"$f":"IF($K$5=\"Course 1\",Général!F$98,IF($K$5=\"Course 2\",Général!F$100,IF($K$5=\"Course 3\",Général!#REF!,Général!F$102)))","v":"Equipage 4"},{"$f":"IF($L$5=\"Course 1\",Général!F$106,IF($L$5=\"Course 2\",Général!$F108,IF($L$5=\"Course 3\",Général!#REF!,Général!F$110)))","v":"Equipage 9"},{"$f":"IF($M$5=\"Course 1\",Général!F$114,IF($M$5=\"Course 2\",Général!F$116,IF($M$5=\"Course 3\",Général!#REF!,Général!F$118)))","v":"Equipage 3"},{"$f":"IF($N$5=\"Course 1\",Général!F$122,IF($N$5=\"Course 2\",Général!F$124,IF($N$5=\"Course 3\",Général!#REF!,Général!F$126)))","v":"Equipage 4"},{"$f":"IF($O$5=\"Course 1\",Général!F$130,IF($O$5=\"Course 2\",Général!F$132,IF($O$5=\"Course 3\",Général!#REF!,Général!F$134)))","v":"Equipage 10"},{"$f":"IF($P$5=\"Course 1\",Général!F$138,IF($P$5=\"Course 2\",Général!F$140,IF($P$5=\"Course 3\",Général!#REF!,Général!F$142)))","v":"Equipage 3"},{"$f":"IF($Q$5=\"Course 1\",Général!F$146,IF($Q$5=\"Course 2\",Général!F$148,IF($Q$5=\"Course 3\",Général!#REF!,Général!F$150)))","v":"Equipage 5"},{"$f":"IF($R$5=\"Course 1\",Général!F$154,IF($R$5=\"Course 2\",Général!F$156,IF($R$5=\"Course 3\",Général!F$158,Général!F$160)))","v":"Equipage 4"}]
["7ème Equipage",null,{"$f":"IF($C$5=\"Course 1\",Général!H34,IF($C$5=\"Course 2\",Général!H36,IF($C$5=\"Course 3\",Général!#REF!,Général!H38)))","v":0},{"$f":"IF($D$5=\"Course 1\",Général!H42,IF($D$5=\"Course 2\",Général!H44,IF($D$5=\"Course 3\",Général!#REF!,Général!H46)))","v":0},{"$f":"IF($E$5=\"Course 1\",Général!H50,IF($E$5=\"Course 2\",Général!H52,IF($E$5=\"Course 3\",Général!#REF!,Général!H54)))","v":0},{"$f":"IF($F$5=\"Course 1\",Général!H$58,IF($F$5=\"Course 2\",Général!H$60,IF($F$5=\"Course 3\",Général!#REF!,Général!H$62)))","v":0},{"$f":"IF($G$5=\"Course 1\",Général!H$66,IF($G$5=\"Course 2\",Général!H$68,IF($G$5=\"Course 3\",Général!#REF!,Général!H$70)))","v":0},{"$f":"IF($H$5=\"Course 1\",Général!H$74,IF($H$5=\"Course 2\",Général!H$76,IF($H$5=\"Course 3\",Général!#REF!,Général!H$78)))","v":0},{"$f":"IF($I$5=\"Course 1\",Général!H$82,IF($I$5=\"Course 2\",Général!H$84,IF($I$5=\"Course 3\",Général!#REF!,Général!H$86)))","v":0},{"$f":"IF($J$5=\"Course 1\",Général!H$90,IF($J$5=\"Course 2\",Général!H$92,IF($J$5=\"Course 3\",Général!#REF!,Général!H$94)))","v":0},{"$f":"IF($K$5=\"Course 1\",Général!H$98,IF($K$5=\"Course 2\",Général!H$100,IF($K$5=\"Course 3\",Général!#REF!,Général!H$102)))","v":0},{"$f":"IF($L$5=\"Course 1\",Général!H$106,IF($L$5=\"Course 2\",Général!H$108,IF($L$5=\"Course 3\",Général!#REF!,Général!H$110)))","v":0},{"$f":"IF($M$5=\"Course 1\",Général!H$114,IF($M$5=\"Course 2\",Général!H$116,IF($M$5=\"Course 3\",Général!#REF!,Général!H$118)))","v":0},{"$f":"IF($N$5=\"Course 1\",Général!H$122,IF($N$5=\"Course 2\",Général!H$124,IF($N$5=\"Course 3\",Général!#REF!,Général!H$126)))","v":0},{"$f":"IF($O$5=\"Course 1\",Général!H$130,IF($O$5=\"Course 2\",Général!H$132,IF($O$5=\"Course 3\",Général!#REF!,Général!H$134)))","v":0},{"$f":"IF($P$5=\"Course 1\",Général!H$138,IF($P$5=\"Course 2\",Général!H$140,IF($P$5=\"Course 3\",Général!#REF!,Général!H$142)))","v":0},{"$f":"IF($Q$5=\"Course 1\",Général!H$146,IF($Q$5=\"Course 2\",Général!H$148,IF($Q$5=\"Course 3\",Général!#REF!,Général!H$150)))","v":0},{"$f":"IF($R$5=\"Course 1\",Général!H$154,IF($R$5=\"Course 2\",Général!H$156,IF($R$5=\"Course 3\",Général!H$158,Général!H$160)))","v":0},null,null,null,{"$f":"Général!B14","v":"Equipage 14"},{"$f":"COUNTIF($C$8:$R$16,V13)","v":0}]
["8ème Equipage",null,{"$f":"IF($C$5=\"Course 1\",Général!I34,IF($C$5=\"Course 2\",Général!I36,IF($C$5=\"Course 3\",Général!#REF!,Général!I38)))","v":0},{"$f":"IF($D$5=\"Course 1\",Général!I42,IF($D$5=\"Course 2\",Général!I44,IF($D$5=\"Course 3\",Général!#REF!,Général!I46)))","v":0},{"$f":"IF($E$5=\"Course 1\",Général!I50,IF($E$5=\"Course 2\",Général!I52,IF($E$5=\"Course 3\",Général!#REF!,Général!I54)))","v":0},{"$f":"IF($F$5=\"Course 1\",Général!I$58,IF($F$5=\"Course 2\",Général!I$60,IF($F$5=\"Course 3\",Général!#REF!,Général!I$62)))","v":0},{"$f":"IF($G$5=\"Course 1\",Général!I$66,IF($G$5=\"Course 2\",Général!I$68,IF($G$5=\"Course 3\",Général!#REF!,Général!I$70)))","v":0},{"$f":"IF($H$5=\"Course 1\",Général!I$74,IF($H$5=\"Course 2\",Général!I$76,IF($H$5=\"Course 3\",Général!#REF!,Général!I$78)))","v":0},{"$f":"IF($I$5=\"Course 1\",Général!I$82,IF($I$5=\"Course 2\",Général!I$84,IF($I$5=\"Course 3\",Général!#REF!,Général!I$86)))","v":0},{"$f":"IF($J$5=\"Course 1\",Général!I$90,IF($J$5=\"Course 2\",Général!I$92,IF($J$5=\"Course 3\",Général!#REF!,Général!I$94)))","v":0},{"$f":"IF($K$5=\"Course 1\",Général!I$98,IF($K$5=\"Course 2\",Général!I$100,IF($K$5=\"Course 3\",Général!#REF!,Général!I$102)))","v":0},{"$f":"IF($L$5=\"Course 1\",Général!I$106,IF($L$5=\"Course 2\",Général!I$108,IF($L$5=\"Course 3\",Général!#REF!,Général!I$110)))","v":0},{"$f":"IF($M$5=\"Course 1\",Général!I$114,IF($M$5=\"Course 2\",Général!I$116,IF($M$5=\"Course 3\",Général!#REF!,Général!I$118)))","v":0},{"$f":"IF($N$5=\"Course 1\",Général!I$122,IF($N$5=\"Course 2\",Général!I$124,IF($N$5=\"Course 3\",Général!#REF!,Général!I$126)))","v":0},{"$f":"IF($O$5=\"Course 1\",Général!I$130,IF($O$5=\"Course 2\",Général!I$132,IF($O$5=\"Course 3\",Général!#REF!,Général!I$134)))","v":0},{"$f":"IF($P$5=\"Course 1\",Général!I$138,IF($P$5=\"Course 2\",Général!I$140,IF($P$5=\"Course 3\",Général!#REF!,Général!I$142)))","v":0},{"$f":"IF($Q$5=\"Course 1\",Général!I$146,IF($Q$5=\"Course 2\",Général!I$148,IF($Q$5=\"Course 3\",Général!#REF!,Général!I$150)))","v":0},{"$f":"IF($R$5=\"Course 1\",Général!I$154,IF($R$5=\"Course 2\",Général!I$156,IF($R$5=\"Course 3\",Général!I$158,Général!I$160)))","v":0},null,null,null,{"$f":"Général!B15","v":"Equipage 15"},0]
["9ème Equipage",null,{"$f":"IF($C$5=\"Course 1\",Général!J34,IF($C$5=\"Course 2\",Général!J36,IF($C$5=\"Course 3\",Général!#REF!,Général!J38)))","v":0},{"$f":"IF($D$5=\"Course 1\",Général!J42,IF($D$5=\"Course 2\",Général!J44,IF($D$5=\"Course 3\",Général!#REF!,Général!J46)))","v":0},{"$f":"IF($E$5=\"Course 1\",Général!J50,IF($E$5=\"Course 2\",Général!J52,IF($E$5=\"Course 3\",Général!#REF!,Général!J54)))","v":0},{"$f":"IF($F$5=\"Course 1\",Général!J$58,IF($F$5=\"Course 2\",Général!J$60,IF($F$5=\"Course 3\",Général!#REF!,Général!J$62)))","v":0},{"$f":"IF($G$5=\"Course 1\",Général!J$66,IF($G$5=\"Course 2\",Général!J$68,IF($G$5=\"Course 3\",Général!#REF!,Général!J$70)))","v":0},{"$f":"IF($H$5=\"Course 1\",Général!J$74,IF($H$5=\"Course 2\",Général!J$76,IF($H$5=\"Course 3\",Général!#REF!,Général!J$78)))","v":0},{"$f":"IF($I$5=\"Course 1\",Général!J$82,IF($I$5=\"Course 2\",Général!J$84,IF($I$5=\"Course 3\",Général!#REF!,Général!J$86)))","v":0},{"$f":"IF($J$5=\"Course 1\",Général!J$90,IF($J$5=\"Course 2\",Général!J$92,IF($J$5=\"Course 3\",Général!#REF!,Général!J$94)))","v":0},{"$f":"IF($K$5=\"Course 1\",Général!J$98,IF($K$5=\"Course 2\",Général!J$100,IF($K$5=\"Course 3\",Général!#REF!,Général!J$102)))","v":0},{"$f":"IF($L$5=\"Course 1\",Général!J$106,IF($L$5=\"Course 2\",Général!J$108,IF($L$5=\"Course 3\",Général!#REF!,Général!J$110)))","v":0},{"$f":"IF($M$5=\"Course 1\",Général!J$114,IF($M$5=\"Course 2\",Général!J$116,IF($M$5=\"Course 3\",Général!#REF!,Général!J$118)))","v":0},{"$f":"IF($N$5=\"Course 1\",Général!J$122,IF($N$5=\"Course 2\",Général!J$124,IF($N$5=\"Course 3\",Général!#REF!,Général!J$126)))","v":0},{"$f":"IF($O$5=\"Course 1\",Général!J$130,IF($O$5=\"Course 2\",Général!J$132,IF($O$5=\"Course 3\",Général!#REF!,Général!J$134)))","v":0},{"$f":"IF($P$5=\"Course 1\",Général!J$138,IF($P$5=\"Course 2\",Général!J$140,IF($P$5=\"Course 3\",Général!#REF!,Général!J$142)))","v":0},{"$f":"IF($Q$5=\"Course 1\",Général!J$146,IF($Q$5=\"Course 2\",Général!J$148,IF($Q$5=\"Course 3\",Général!#REF!,Général!J$150)))","v":0},{"$f":"IF($R$5=\"Course 1\",Général!J$154,IF($R$5=\"Course 2\",Général!J$156,IF($R$5=\"Course 3\",Général!J$158,Général!J$160)))","v":0},null,null,null,{"$f":"Général!B16","v":"Equipage 16"},0]
["10ème Equipage",null,{"$f":"IF($C$5=\"Course 1\",Général!K34,IF($C$5=\"Course 2\",Général!K36,IF($C$5=\"Course 3\",Général!#REF!,Général!K38)))","v":0},{"$f":"IF($D$5=\"Course 1\",Général!K42,IF($D$5=\"Course 2\",Général!K44,IF($D$5=\"Course 3\",Général!#REF!,Général!K46)))","v":0},{"$f":"IF($E$5=\"Course 1\",Général!K50,IF($E$5=\"Course 2\",Général!K52,IF($E$5=\"Course 3\",Général!#REF!,Général!K54)))","v":0},{"$f":"IF($F$5=\"Course 1\",Général!K$58,IF($F$5=\"Course 2\",Général!K$60,IF($F$5=\"Course 3\",Général!#REF!,Général!K$62)))","v":0},{"$f":"IF($G$5=\"Course 1\",Général!K$66,IF($G$5=\"Course 2\",Général!K$68,IF($G$5=\"Course 3\",Général!#REF!,Général!K$70)))","v":0},{"$f":"IF($H$5=\"Course 1\",Général!K$74,IF($H$5=\"Course 2\",Général!K$76,IF($H$5=\"Course 3\",Général!#REF!,Général!K$78)))","v":0},{"$f":"IF($I$5=\"Course 1\",Général!K$82,IF($I$5=\"Course 2\",Général!K$84,IF($I$5=\"Course 3\",Général!#REF!,Général!K$86)))","v":0},{"$f":"IF($J$5=\"Course 1\",Général!K$90,IF($J$5=\"Course 2\",Général!K$92,IF($J$5=\"Course 3\",Général!#REF!,Général!K$94)))","v":0},{"$f":"IF($K$5=\"Course 1\",Général!K$98,IF($K$5=\"Course 2\",Général!K$100,IF($K$5=\"Course 3\",Général!#REF!,Général!K$102)))","v":0},{"$f":"IF($L$5=\"Course 1\",Général!K$106,IF($L$5=\"Course 2\",Général!K$108,IF($L$5=\"Course 3\",Général!#REF!,Général!K$110)))","v":0},{"$f":"IF($M$5=\"Course 1\",Général!K$114,IF($M$5=\"Course 2\",Général!K$116,IF($M$5=\"Course 3\",Général!#REF!,Général!K$118)))","v":0},{"$f":"IF($N$5=\"Course 1\",Général!K$122,IF($N$5=\"Course 2\",Général!K$124,IF($N$5=\"Course 3\",Général!#REF!,Général!K$126)))","v":0},{"$f":"IF($O$5=\"Course 1\",Général!K$130,IF($O$5=\"Course 2\",Général!K$132,IF($O$5=\"Course 3\",Général!#REF!,Général!K$134)))","v":0},{"$f":"IF($P$5=\"Course 1\",Général!K$138,IF($P$5=\"Course 2\",Général!K$140,IF($P$5=\"Course 3\",Général!#REF!,Général!K$142)))","v":0},{"$f":"IF($Q$5=\"Course 1\",Général!K$146,IF($Q$5=\"Course 2\",Général!K$148,IF($Q$5=\"Course 3\",Général!#REF!,Général!K$150)))","v":0},{"$f":"IF($R$5=\"Course 1\",Général!K$154,IF($R$5=\"Course 2\",Général!K$156,IF($R$5=\"Course 3\",Général!K$158,Général!K$160)))","v":0},null,null,null,{"$f":"Général!B17","v":"Equipage 17"},0]
[null,null,null,null,null,null,null,null,null,null,null,null,null,null,null,null,null,null,null,null,null,{"$f":"Général!B18","v":"Equipage 18"},0]
[null,null,null,null,null,null,null,null,null,null,null,null,null,null,null,null,null,null,null,null,null,{"$f":"Général!B19","v":"Equipage 19"},0]
[null,null,null,null,null,null,null,null,null,null,null,null,null,null,null,null,null,null,null,null,null,{"$f":"Général!B20","v":"Equipage 20"},0]
[null,null,null,null,null,null,null,null,null,null,null,null,null,null,null,null,null,null,null,null,null,{"$f":"Général!B21","v":"Equipage 21"},0]
[null,null,null,null,null,null,null,null,null,null,null,null,null,null,null,null,null,null,null,null,null,{"$f":"Général!B22","v":"Equipage 22"},0]
[null,null,null,null,null,null,null,null,null,null,null,null,null,null,null,null,null,null,null,null,null,{"$f":"Général!B23","v":"Equipage 23"},0]
[null,null,null,null,null,null,null,null,null,null,null,null,null,null,null,null,null,null,null,null,null,{"$f":"Général!B24","v":"Equipage 24"},0]
[null,null,null,null,null,null,null,null,null,null,null,null,null,null,null,null,null,null,null,null,null,{"$f":"Général!B25","v":"Equipage 25"},0]
[null,null,null,null,null,null,null,null,null,null,null,null,null,null,null,null,null,null,null,null,null,{"$f":"Général!B26","v":"Equipage 26"},0]
[null,null,null,null,null,null,null,null,null,null,null,null,null,null,null,null,null,null,null,null,null,{"$f":"Général!B27","v":"Equipage 27"},0]
[null,null,null,null,null,null,null,null,null,null,null,null,null,null,null,null,null,null,null,null,null,{"$f":"Général!B28","v":"Equipage 28"},0]
[null,null,null,null,null,null,null,null,null,null,null,null,null,null,null,null,null,null,null,null,null,{"$f":"Général!B29","v":"Equipage 29"},0]
[null,null,null,null,null,null,null,null,null,null,null,null,null,null,null,null,null,null,null,null,null,{"$f":"Général!B30","v":"Equipage 30"},0]

{"sheet":"Eq.5","index":10,"n_rows":29,"n_cols":23,"rows_kept":29,"cut":false,"hidden":true,"merged":[[7,0,7,1],[0,0,1,5],[0,6,1,10],[3,0,3,1],[4,0,4,1],[5,0,5,1],[14,0,14,1],[15,0,15,1],[8,0,8,1],[9,0,9,1],[10,0,10,1],[11,0,11,1],[12,0,12,1],[13,0,13,1]]}
["Equipage ",null,null,null,null,null,{"$f":"Général!B7","v":"Equipage 5"},null,null,null,null,null,null,null,null,null,null,null,null,null,null,{"$f":"Général!B3","v":"Equipage 1"},{"$f":"COUNTIF(C$8:R$16,V1)","v":5}]
[null,null,null,null,null,null,null,null,null,null,null,null,null,null,null,null,null,null,null,null,null,{"$f":"Général!B4","v":"Equipage 2"},{"$f":"COUNTIF($C$8:$R$16,V2)","v":8}]
[null,null,null,null,null,null,null,null,null,null,null,null,null,null,null,null,null,null,null,null,null,{"$f":"Général!B5","v":"Equipage 3"},5]
[null,null,"FLIGHT 1","FLIGHT 2","FLIGHT 3","FLIGHT 4","FLIGHT 5","FLIGHT 6","FLIGHT 7","FLIGHT 8","FLIGHT 9","FLIGHT 10","FLIGHT 11","FLIGHT 12","FLIGHT 13","FLIGHT 14","FLIGHT 15","FLIGHT 16","FLIGHT 17","FLIGHT 18",null,{"$f":"Général!B6","v":"Equipage 4"},9]
["N° de course",null,{"$f":"IF(COUNTIF(Général!B34:K34,$G$1)=1,\"Course 1\",IF(COUNTIF(Général!B36:K36,$G$1)=1,\"Course 2\",IF(COUNTIF(Général!#REF!,$G$1)=1,\"Course 3\",\"Course 4\")))","v":"Course 2"},{"$f":"IF(COUNTIF(Général!B42:K42,$G$1)=1,\"Course 1\",IF(COUNTIF(Général!B44:K44,$G$1)=1,\"Course 2\",IF(COUNTIF(Général!#REF!,$G$1)=1,\"Course 3\",\"Course 4\")))","v":"Course 2"},{"$f":"IF(COUNTIF(Général!B50:K50,$G$1)=1,\"Course 1\",IF(COUNTIF(Général!B52:K52,$G$1)=1,\"Course 2\",IF(COUNTIF(Général!#REF!,$G$1)=1,\"Course 3\",\"Course 4\")))","v":"Course 1"},{"$f":"IF(COUNTIF(Général!B58:K58,$G$1)=1,\"Course 1\",IF(COUNTIF(Général!B60:K60,$G$1)=1,\"Course 2\",IF(COUNTIF(Général!#REF!,$G$1)=1,\"Course 3\",\"Course 4\")))","v":"Course 2"},{"$f":"IF(COUNTIF(Général!B66:K66,$G$1)=1,\"Course 1\",IF(COUNTIF(Général!B68:K68,$G$1)=1,\"Course 2\",IF(COUNTIF(Général!#REF!,$G$1)=1,\"Course 3\",\"Course 4\")))","v":"Course 2"},{"$f":"IF(COUNTIF(Général!B74:K74,$G$1)=1,\"Course 1\",IF(COUNTIF(Général!B76:K76,$G$1)=1,\"Course 2\",IF(COUNTIF(Général!#REF!,$G$1)=1,\"Course 3\",\"Course 4\")))","v":"Course 2"},{"$f":"IF(COUNTIF(Général!B82:K82,$G$1)=1,\"Course 1\",IF(COUNTIF(Général!B84:K84,$G$1)=1,\"Course 2\",IF(COUNTIF(Général!#REF!,$G$1)=1,\"Course 3\",\"Course 4\")))","v":"Course 1"},{"$f":"IF(COUNTIF(Général!B90:K90,$G$1)=1,\"Course 1\",IF(COUNTIF(Général!B92:K92,$G$1)=1,\"Course 2\",IF(COUNTIF(Général!#REF!,$G$1)=1,\"Course 3\",\"Course 4\")))","v":"Course 1"},{"$f":"IF(COUNTIF(Général!B98:K98,$G$1)=1,\"Course 1\",IF(COUNTIF(Général!B100:K100,$G$1)=1,\"Course 2\",IF(COUNTIF(Général!#REF!,$G$1)=1,\"Course 3\",\"Course 4\")))","v":"Course 2"},{"$f":"IF(COUNTIF(Général!B106:K106,$G$1)=1,\"Course 1\",IF(COUNTIF(Général!B108:K108,$G$1)=1,\"Course 2\",IF(COUNTIF(Général!#REF!,$G$1)=1,\"Course 3\",\"Course 4\")))","v":"Course 1"},{"$f":"IF(COUNTIF(Général!B114:K114,$G$1)=1,\"Course 1\",IF(COUNTIF(Général!B116:K116,$G$1)=1,\"Course 2\",IF(COUNTIF(Général!#REF!,$G$1)=1,\"Course 3\",\"Course 4\")))","v":"Course 1"},{"$f":"IF(COUNTIF(Général!B122:K122,$G$1)=1,\"Course 1\",IF(COUNTIF(Général!B124:K124,$G$1)=1,\"Course 2\",IF(COUNTIF(Général!#REF!,$G$1)=1,\"Course 3\",\"Course 4\")))","v":"Course 2"},{"$f":"IF(COUNTIF(Général!B130:K130,$G$1)=1,\"Course 1\",IF(COUNTIF(Général!B132:K132,$G$1)=1,\"Course 2\",IF(COUNTIF(Général!#REF!,$G$1)=1,\"Course 3\",\"Course 4\")))","v":"Course 2"},{"$f":"IF(COUNTIF(Général!B138:K138,$G$1)=1,\"Course 1\",IF(COUNTIF(Général!B140:K140,$G$1)=1,\"Course 2\",IF(COUNTIF(Général!#REF!,$G$1)=1,\"Course 3\",\"Course 4\")))","v":"Course 1"},{"$f":"IF(COUNTIF(Général!B146:K146,$G$1)=1,\"Course 1\",IF(COUNTIF(Général!B148:K148,$G$1)=1,\"Course 2\",IF(COUNTIF(Général!#REF!,$G$1)=1,\"Course 3\",\"Course 4\")))","v":"Course 1"},{"$f":"IF(COUNTIF(Général!B154:K154,$G$1)=1,\"Course 1\",IF(COUNTIF(Général!B156:K156,$G$1)=1,\"Course 2\",IF(COUNTIF(Général!B158:K158,$G$1)=1,\"Course 3\",\"Course 4\")))","v":"Course 2"},{"$f":"IF(COUNTIF(Général!C154:L154,$G$1)=1,\"Course 1\",IF(COUNTIF(Général!C156:L156,$G$1)=1,\"Course 2\",IF(COUNTIF(Général!C158:L158,$G$1)=1,\"Course 3\",\"Course 4\")))","v":"Course 2"},{"$f":"IF(COUNTIF(Général!D154:M154,$G$1)=1,\"Course 1\",IF(COUNTIF(Général!D156:M156,$G$1)=1,\"Course 2\",IF(COUNTIF(Général!D158:M158,$G$1)=1,\"Course 3\",\"Course 4\")))","v":"Course 2"},null,{"$f":"Général!B7","v":"Equipage 5"},16]
["Bateau",null,{"$f":"IF(COUNTIF(Général!B34:B38,$G$1)=1,\"Boat 1\",IF(COUNTIF(Général!C34:C38,$G$1)=1,\"Boat 2\",IF(COUNTIF(Général!D34:D38,$G$1)=1,\"Boat 3\",IF(COUNTIF(Général!E34:E38,$G$1)=1,\"Boat 4\",IF(COUNTIF(Général!F34:F38,$G$1)=1,\"Boat 5\",IF(COUNTIF(Général!G34:G38,$G$1)=1,\"Boat 6\",IF(COUNTIF(Général!H34:H38,$G$1)=1,\"Boat 7\",IF(COUNTIF(Général!I34:I38,$G$1)=1,\"Boat 8\",IF(COUNTIF(Général!J34:J38,$G$1)=1,\"Boat 9\",\"Boat10\")))))))))","v":"Boat 2"},{"$f":"IF(COUNTIF(Général!B42:B46,$G$1)=1,\"Boat 1\",IF(COUNTIF(Général!C42:C46,$G$1)=1,\"Boat 2\",IF(COUNTIF(Général!D42:D46,$G$1)=1,\"Boat 3\",IF(COUNTIF(Général!E42:E46,$G$1)=1,\"Boat 4\",IF(COUNTIF(Général!F42:F46,$G$1)=1,\"Boat 5\",IF(COUNTIF(Général!G42:G46,$G$1)=1,\"Boat 6\",IF(COUNTIF(Général!H42:H46,$G$1)=1,\"Boat 7\",IF(COUNTIF(Général!I42:I46,$G$1)=1,\"Boat 8\",IF(COUNTIF(Général!J42:J46,$G$1)=1,\"Boat 9\",\"Boat 10\")))))))))","v":"Boat 1"},{"$f":"IF(COUNTIF(Général!B50:B54,$G$1)=1,\"Boat 1\",IF(COUNTIF(Général!C50:C54,$G$1)=1,\"Boat 2\",IF(COUNTIF(Général!D50:D54,$G$1)=1,\"Boat 3\", IF(COUNTIF(Général!E50:E54,$G$1)=1,\"Boat 4\", IF(COUNTIF(Général!F50:F54,$G$1)=1,\"Boat 5\", IF(COUNTIF(Général!G50:G54,$G$1)=1,\"Boat 6\", IF(COUNTIF(Général!H50:H54,$G$1)=1,\"Boat 7\",IF(COUNTIF(Général!I50:I54,$G$1)=1,\"Boat 8\",IF(COUNTIF(Général!J50:J54,$G$1)=1,\"Boat 9\",\"Boat 10\")))))))))","v":"Boat 1"},{"$f":"IF(COUNTIF(Général!B58:B62,$G$1)=1,\"Boat 1\",IF(COUNTIF(Général!C58:C62,$G$1)=1,\"Boat 2\",IF(COUNTIF(Général!D58:D62,$G$1)=1,\"Boat 3\", IF(COUNTIF(Général!E58:E62,$G$1)=1,\"Boat 4\", IF(COUNTIF(Général!F58:F62,$G$1)=1,\"Boat 5\", IF(COUNTIF(Général!G58:G62,$G$1)=1,\"Boat 6\", IF(COUNTIF(Général!H58:H62,$G$1)=1,\"Boat 7\",IF(COUNTIF(Général!I58:I62,$G$1)=1,\"Boat 8\",IF(COUNTIF(Général!I58:J62,$G$1)=1,\"Boat 9\",\"Boat 10\")))))))))","v":"Boat 4"},{"$f":"IF(COUNTIF(Général!B66:B70,$G$1)=1,\"Boat 1\",IF(COUNTIF(Général!C66:C70,$G$1)=1,\"Boat 2\",IF(COUNTIF(Général!D66:D70,$G$1)=1,\"Boat 3\", IF(COUNTIF(Général!E66:E70,$G$1)=1,\"Boat 4\", IF(COUNTIF(Général!F66:F70,$G$1)=1,\"Boat 5\", IF(COUNTIF(Général!G66:G70,$G$1)=1,\"Boat 6\", IF(COUNTIF(Général!H66:H70,$G$1)=1,\"Boat 7\",IF(COUNTIF(Général!I66:I70,$G$1)=1,\"Boat 8\",IF(COUNTIF(Général!J66:J70,$G$1)=1,\"Boat 9\",\"Boat 10\")))))))))","v":"Boat 4"},{"$f":"IF(COUNTIF(Général!B74:B78,$G$1)=1,\"Boat 1\",IF(COUNTIF(Général!C74:C78,$G$1)=1,\"Boat 2\",IF(COUNTIF(Général!D74:D78,$G$1)=1,\"Boat 3\", IF(COUNTIF(Général!E74:E78,$G$1)=1,\"Boat 4\", IF(COUNTIF(Général!F74:F78,$G$1)=1,\"Boat 5\", IF(COUNTIF(Général!G74:G78,$G$1)=1,\"Boat 6\", IF(COUNTIF(Général!H74:H78,$G$1)=1,\"Boat 7\",IF(COUNTIF(Général!I74:I78,$G$1)=1,\"Boat 8\",IF(COUNTIF(Général!J74:J78,$G$1)=1,\"Boat 9\",\"Boat 10\")))))))))","v":"Boat 5"},{"$f":"IF(COUNTIF(Général!B82:B86,$G$1)=1,\"Boat 1\",IF(COUNTIF(Général!C82:C86,$G$1)=1,\"Boat 2\",IF(COUNTIF(Général!D82:D86,$G$1)=1,\"Boat 3\", IF(COUNTIF(Général!E82:E86,$G$1)=1,\"Boat 4\", IF(COUNTIF(Général!F82:F86,$G$1)=1,\"Boat 5\", IF(COUNTIF(Général!G82:G86,$G$1)=1,\"Boat 6\", IF(COUNTIF(Général!H82:H86,$G$1)=1,\"Boat 7\",IF(COUNTIF(Général!I82:I86,$G$1)=1,\"Boat 8\",IF(COUNTIF(Général!J82:J86,$G$1)=1,\"Boat 9\",\"Boat 10\")))))))))","v":"Boat 5"},{"$f":"IF(COUNTIF(Général!B90:B94,$G$1)=1,\"Boat 1\",IF(COUNTIF(Général!C90:C94,$G$1)=1,\"Boat 2\",IF(COUNTIF(Général!D90:D94,$G$1)=1,\"Boat 3\", IF(COUNTIF(Général!E90:E94,$G$1)=1,\"Boat 4\", IF(COUNTIF(Général!F90:F94,$G$1)=1,\"Boat 5\", IF(COUNTIF(Général!G90:G94,$G$1)=1,\"Boat 6\", IF(COUNTIF(Général!H90:H94,$G$1)=1,\"Boat 7\",IF(COUNTIF(Général!I90:I94,$G$1)=1,\"Boat 8\",IF(COUNTIF(Général!J90:J94,$G$1)=1,\"Boat 9\",\"Boat 10\")))))))))","v":"Boat 3"},{"$f":"IF(COUNTIF(Général!B98:B102,$G$1)=1,\"Boat 1\",IF(COUNTIF(Général!C98:C102,$G$1)=1,\"Boat 2\",IF(COUNTIF(Général!D98:D102,$G$1)=1,\"Boat 3\", IF(COUNTIF(Général!E98:E102,$G$1)=1,\"Boat 4\", IF(COUNTIF(Général!F98:F102,$G$1)=1,\"Boat 5\", IF(COUNTIF(Général!G98:G102,$G$1)=1,\"Boat 6\", IF(COUNTIF(Général!H98:H102,$G$1)=1,\"Boat 7\",IF(COUNTIF(Général!I98:I102,$G$1)=1,\"Boat 8\",IF(COUNTIF(Général!J98:J102,$G$1)=1,\"Boat 9\",\"Boat 10\")))))))))","v":"Boat 3"},{"$f":"IF(COUNTIF(Général!B106:B110,$G$1)=1,\"Boat 1\",IF(COUNTIF(Général!C106:C110,$G$1)=1,\"Boat 2\",IF(COUNTIF(Général!D106:D110,$G$1)=1,\"Boat 3\", IF(COUNTIF(Général!E106:E110,$G$1)=1,\"Boat 4\", IF(COUNTIF(Général!F106:F110,$G$1)=1,\"Boat 5\", IF(COUNTIF(Général!G106:G110,$G$1)=1,\"Boat 6\", IF(COUNTIF(Général!H106:H110,$G$1)=1,\"Boat 7\",IF(COUNTIF(Général!I106:I110,$G$1)=1,\"Boat 8\",IF(COUNTIF(Général!J106:J110,$G$1)=1,\"Boat 9\",\"Boat 10\")))))))))","v":"Boat 3"},{"$f":"IF(COUNTIF(Général!B114:B118,$G$1)=1,\"Boat 1\",IF(COUNTIF(Général!C114:C118,$G$1)=1,\"Boat 2\",IF(COUNTIF(Général!C114:D118,$G$1)=1,\"Boat 3\", IF(COUNTIF(Général!C114:E118,$G$1)=1,\"Boat 4\", IF(COUNTIF(Général!F114:F118,$G$1)=1,\"Boat 5\", IF(COUNTIF(Général!G114:G118,$G$1)=1,\"Boat 6\", IF(COUNTIF(Général!H114:H118,$G$1)=1,\"Boat 7\",IF(COUNTIF(Général!I114:I118,$G$1)=1,\"Boat 8\",IF(COUNTIF(Général!J114:J118,$G$1)=1,\"Boat 9\",\"Boat 10\")))))))))","v":"Boat 1"},{"$f":"IF(COUNTIF(Général!B122:B126,$G$1)=1,\"Boat 1\",IF(COUNTIF(Général!C122:C126,$G$1)=1,\"Boat 2\",IF(COUNTIF(Général!D122:D126,$G$1)=1,\"Boat 3\", IF(COUNTIF(Général!E122:E126,$G$1)=1,\"Boat 4\", IF(COUNTIF(Général!F122:F126,$G$1)=1,\"Boat 5\", IF(COUNTIF(Général!G122:G126,$G$1)=1,\"Boat 6\", IF(COUNTIF(Général!H122:H126,$G$1)=1,\"Boat 7\",IF(COUNTIF(Général!I122:I126,$G$1)=1,\"Boat 8\",IF(COUNTIF(Général!J122:J126,$G$1)=1,\"Boat 9\",\"Boat 10\")))))))))","v":"Boat 2"},{"$f":"IF(COUNTIF(Général!B130:B134,$G$1)=1,\"Boat 1\",IF(COUNTIF(Général!C130:C134,$G$1)=1,\"Boat 2\",IF(COUNTIF(Général!D130:D134,$G$1)=1,\"Boat 3\", IF(COUNTIF(Général!E130:E134,$G$1)=1,\"Boat 4\", IF(COUNTIF(Général!F130:F134,$G$1)=1,\"Boat 5\", IF(COUNTIF(Général!G130:G134,$G$1)=1,\"Boat 6\", IF(COUNTIF(Général!H130:H134,$G$1)=1,\"Boat 7\",IF(COUNTIF(Général!I130:I134,$G$1)=1,\"Boat 8\",IF(COUNTIF(Général!J130:J134,$G$1)=1,\"Boat 9\",\"Boat 10\")))))))))","v":"Boat 4"},{"$f":"IF(COUNTIF(Général!B138:B142,$G$1)=1,\"Boat 1\",IF(COUNTIF(Général!C138:C142,$G$1)=1,\"Boat 2\",IF(COUNTIF(Général!D138:D142,$G$1)=1,\"Boat 3\", IF(COUNTIF(Général!E138:E142,$G$1)=1,\"Boat 4\", IF(COUNTIF(Général!F138:F142,$G$1)=1,\"Boat 5\", IF(COUNTIF(Général!G138:G142,$G$1)=1,\"Boat 6\", IF(COUNTIF(Général!H138:H142,$G$1)=1,\"Boat 7\",IF(COUNTIF(Général!I138:I142,$G$1)=1,\"Boat 8\",IF(COUNTIF(Général!J138:J142,$G$1)=1,\"Boat 9\",\"Boat 10\")))))))))","v":"Boat 4"},{"$f":"IF(COUNTIF(Général!B146:B150,$G$1)=1,\"Boat 1\",IF(COUNTIF(Général!C146:C150,$G$1)=1,\"Boat 2\",IF(COUNTIF(Général!D146:D150,$G$1)=1,\"Boat 3\", IF(COUNTIF(Général!E146:E150,$G$1)=1,\"Boat 4\", IF(COUNTIF(Général!F146:F150,$G$1)=1,\"Boat 5\", IF(COUNTIF(Général!G146:G150,$G$1)=1,\"Boat 6\", IF(COUNTIF(Général!H146:H150,$G$1)=1,\"Boat 7\",IF(COUNTIF(Général!I146:I150,$G$1)=1,\"Boat 8\",IF(COUNTIF(Général!J146:J150,$G$1)=1,\"Boat 9\",\"Boat 10\")))))))))","v":"Boat 5"},{"$f":"IF(COUNTIF(Général!B154:B157,$G$1)=1,\"Boat 1\",IF(COUNTIF(Général!C154:C157,$G$1)=1,\"Boat 2\",IF(COUNTIF(Général!D154:D157,$G$1)=1,\"Boat 3\", IF(COUNTIF(Général!E154:E157,$G$1)=1,\"Boat 4\", IF(COUNTIF(Général!F154:F157,$G$1)=1,\"Boat 5\", IF(COUNTIF(Général!G154:G157,$G$1)=1,\"Boat 6\", IF(COUNTIF(Général!H154:H157,$G$1)=1,\"Boat 7\",IF(COUNTIF(Général!I154:I157,$G$1)=1,\"Boat 8\",IF(COUNTIF(Général!J154:J157,$G$1)=1,\"Boat 9\",\"Boat 10\")))))))))","v":"Boat 4"},{"$f":"IF(COUNTIF(Général!B160:B163,$G$1)=1,\"Boat 1\",IF(COUNTIF(Général!C160:C163,$G$1)=1,\"Boat 2\",IF(COUNTIF(Général!D160:D163,$G$1)=1,\"Boat 3\", IF(COUNTIF(Général!E160:E163,$G$1)=1,\"Boat 4\", IF(COUNTIF(Général!F160:F163,$G$1)=1,\"Boat 5\", IF(COUNTIF(Général!G160:G163,$G$1)=1,\"Boat 6\", IF(COUNTIF(Général!H160:H163,$G$1)=1,\"Boat 7\",IF(COUNTIF(Général!I160:I163,$G$1)=1,\"Boat 8\",IF(COUNTIF(Général!J160:J163,$G$1)=1,\"Boat 9\",\"Boat 10\")))))))))","v":"Boat 4"},{"$f":"IF(COUNTIF(Général!B166:B169,$G$1)=1,\"Boat 1\",IF(COUNTIF(Général!C166:C169,$G$1)=1,\"Boat 2\",IF(COUNTIF(Général!D166:D169,$G$1)=1,\"Boat 3\", IF(COUNTIF(Général!E166:E169,$G$1)=1,\"Boat 4\", IF(COUNTIF(Général!F166:F169,$G$1)=1,\"Boat 5\", IF(COUNTIF(Général!G166:G169,$G$1)=1,\"Boat 6\", IF(COUNTIF(Général!H166:H169,$G$1)=1,\"Boat 7\",IF(COUNTIF(Général!I166:I169,$G$1)=1,\"Boat 8\",IF(COUNTIF(Général!J166:J169,$G$1)=1,\"Boat 9\",\"Boat 10\")))))))))","v":"Boat 4"},null,{"$f":"Général!B8","v":"Equipage 6"},5]
[null,null,null,null,null,null,null,null,null,null,null,null,null,null,null,null,null,null,null,null,null,{"$f":"Général!B9","v":"Equipage 7"},8]
["1er Equipage",null,{"$f":"IF($C$5=\"Course 1\",Général!B34,IF($C$5=\"Course 2\",Général!B36,IF($C$5=\"Course 3\",Général!#REF!,Général!B38)))","v":"Equipage 8"},{"$f":"IF($D$5=\"Course 1\",Général!B42,IF($D$5=\"Course 2\",Général!B44,IF($D$5=\"Course 3\",Général!#REF!,Général!B46)))","v":"Equipage 5"},{"$f":"IF($E$5=\"Course 1\",Général!B50,IF($E$5=\"Course 2\",Général!B52,IF($E$5=\"Course 3\",Général!#REF!,Général!B54)))","v":"Equipage 5"},{"$f":"IF($F$5=\"Course 1\",Général!B$58,IF($F$5=\"Course 2\",Général!B$60,IF($F$5=\"Course 3\",Général!#REF!,Général!B$62)))","v":"Equipage 2"},{"$f":"IF($G$5=\"Course 1\",Général!B$66,IF($G$5=\"Course 2\",Général!B$68,IF($G$5=\"Course 3\",Général!#REF!,Général!B$70)))","v":"Equipage 4"},{"$f":"IF($H$5=\"Course 1\",Général!B$74,IF($H$5=\"Course 2\",Général!B$76,IF($H$5=\"Course 3\",Général!#REF!,Général!B$78)))","v":"Equipage 4"},{"$f":"IF($I$5=\"Course 1\",Général!B$82,IF($I$5=\"Course 2\",Général!B$84,IF($I$5=\"Course 3\",Général!#REF!,Général!B$86)))","v":"Equipage 4"},{"$f":"IF($J$5=\"Course 1\",Général!B$90,IF($J$5=\"Course 2\",Général!B$92,IF($J$5=\"Course 3\",Général!#REF!,Général!B$94)))","v":"Equipage 6"},{"$f":"IF($K$5=\"Course 1\",Général!B$98,IF($K$5=\"Course 2\",Général!B$100,IF($K$5=\"Course 3\",Général!#REF!,Général!B$102)))","v":"Equipage 3"},{"$f":"IF($L$5=\"Course 1\",Général!B$106,IF($L$5=\"Course 2\",Général!B$108,IF($L$5=\"Course 3\",Général!#REF!,Général!B$110)))","v":"Equipage 3"},{"$f":"IF($M$5=\"Course 1\",Général!B$114,IF($M$5=\"Course 2\",Général!B$116,IF($M$5=\"Course 3\",Général!#REF!,Général!B$118)))","v":"Equipage 5"},{"$f":"IF($N$5=\"Course 1\",Général!B$122,IF($N$5=\"Course 2\",Général!B$124,IF($N$5=\"Course 3\",Général!#REF!,Général!B$126)))","v":"Equipage 8"},{"$f":"IF($O$5=\"Course 1\",Général!B$130,IF($O$5=\"Course 2\",Général!B$132,IF($O$5=\"Course 3\",Général!#REF!,Général!B$134)))","v":"Equipage 4"},{"$f":"IF($P$5=\"Course 1\",Général!B$138,IF($P$5=\"Course 2\",Général!B$140,IF($P$5=\"Course 3\",Général!#REF!,Général!B$142)))","v":"Equipage 9"},{"$f":"IF($Q$5=\"Course 1\",Général!B$146,IF($Q$5=\"Course 2\",Général!B$148,IF($Q$5=\"Course 3\",Général!#REF!,Général!B$150)))","v":"Equipage 8"},{"$f":"IF($R$5=\"Course 1\",Général!B$154,IF($R$5=\"Course 2\",Général!B$156,IF($R$5=\"Course 3\",Général!B$158,Général!B$160)))","v":"Equipage 3"},null,null,null,{"$f":"Général!B10","v":"Equipage 8"},12]
["2nd Equipage",null,{"$f":"IF($C$5=\"Course 1\",Général!C34,IF($C$5=\"Course 2\",Général!C36,IF($C$5=\"Course 3\",Général!#REF!,Général!C38)))","v":"Equipage 5"},{"$f":"IF($D$5=\"Course 1\",Général!C42,IF($D$5=\"Course 2\",Général!C44,IF($D$5=\"Course 3\",Général!#REF!,Général!C46)))","v":"Equipage 2"},{"$f":"IF($E$5=\"Course 1\",Général!C50,IF($E$5=\"Course 2\",Général!C52,IF($E$5=\"Course 3\",Général!#REF!,Général!C54)))","v":"Equipage 8"},{"$f":"IF($F$5=\"Course 1\",Général!C$58,IF($F$5=\"Course 2\",Général!C$60,IF($F$5=\"Course 3\",Général!#REF!,Général!C$62)))","v":"Equipage 4"},{"$f":"IF($G$5=\"Course 1\",Général!C$66,IF($G$5=\"Course 2\",Général!C$68,IF($G$5=\"Course 3\",Général!#REF!,Général!C$70)))","v":"Equipage 10"},{"$f":"IF($H$5=\"Course 1\",Général!C$74,IF($H$5=\"Course 2\",Général!C$76,IF($H$5=\"Course 3\",Général!#REF!,Général!C$78)))","v":"Equipage 8"},{"$f":"IF($I$5=\"Course 1\",Général!C$82,IF($I$5=\"Course 2\",Général!C$84,IF($I$5=\"Course 3\",Général!#REF!,Général!C$86)))","v":"Equipage 8"},{"$f":"IF($J$5=\"Course 1\",Général!C$90,IF($J$5=\"Course 2\",Général!C$92,IF($J$5=\"Course 3\",Général!#REF!,Général!C$94)))","v":"Equipage 9"},{"$f":"IF($K$5=\"Course 1\",Général!C$98,IF($K$5=\"Course 2\",Général!C$100,IF($K$5=\"Course 3\",Général!#REF!,Général!C$102)))","v":"Equipage 8"},{"$f":"IF($L$5=\"Course 1\",Général!C$106,IF($L$5=\"Course 2\",Général!C$108,IF($L$5=\"Course 3\",Général!#REF!,Général!C$110)))","v":"Equipage 6"},{"$f":"IF($M$5=\"Course 1\",Général!C$114,IF($M$5=\"Course 2\",Général!C$116,IF($M$5=\"Course 3\",Général!#REF!,Général!C$118)))","v":"Equipage 2"},{"$f":"IF($N$5=\"Course 1\",Général!C$122,IF($N$5=\"Course 2\",Général!C$124,IF($N$5=\"Course 3\",Général!#REF!,Général!C$126)))","v":"Equipage 5"},{"$f":"IF($O$5=\"Course 1\",Général!C$130,IF($O$5=\"Course 2\",Général!C$132,IF($O$5=\"Course 3\",Général!#REF!,Général!C$134)))","v":"Equipage 7"},{"$f":"IF($P$5=\"Course 1\",Général!C$138,IF($P$5=\"Course 2\",Général!C$140,IF($P$5=\"Course 3\",Général!#REF!,Général!C$142)))","v":"Equipage 2"},{"$f":"IF($Q$5=\"Course 1\",Général!C$146,IF($Q$5=\"Course 2\",Général!C$148,IF($Q$5=\"Course 3\",Général!#REF!,Général!C$150)))","v":"Equipage 1"},{"$f":"IF($R$5=\"Course 1\",Général!C$154,IF($R$5=\"Course 2\",Général!C$156,IF($R$5=\"Course 3\",Général!C$158,Général!C$160)))","v":"Equipage 9"},null,null,null,{"$f":"Général!B11","v":"Equipage 9"},6]
["3ème Equipage",null,{"$f":"IF($C$5=\"Course 1\",Général!D34,IF($C$5=\"Course 2\",Général!D36,IF($C$5=\"Course 3\",Général!#REF!,Général!D38)))","v":"Equipage 9"},{"$f":"IF($D$5=\"Course 1\",Général!D42,IF($D$5=\"Course 2\",Général!D44,IF($D$5=\"Course 3\",Général!#REF!,Général!D46)))","v":"Equipage 3"},{"$f":"IF($E$5=\"Course 1\",Général!D50,IF($E$5=\"Course 2\",Général!D52,IF($E$5=\"Course 3\",Général!#REF!,Général!D54)))","v":"Equipage 4"},{"$f":"IF($F$5=\"Course 1\",Général!D$58,IF($F$5=\"Course 2\",Général!D$60,IF($F$5=\"Course 3\",Général!#REF!,Général!D$62)))","v":"Equipage 8"},{"$f":"IF($G$5=\"Course 1\",Général!D$66,IF($G$5=\"Course 2\",Général!D$68,IF($G$5=\"Course 3\",Général!#REF!,Général!D$70)))","v":"Equipage 8"},{"$f":"IF($H$5=\"Course 1\",Général!D$74,IF($H$5=\"Course 2\",Général!D$76,IF($H$5=\"Course 3\",Général!#REF!,Général!D$78)))","v":"Equipage 9"},{"$f":"IF($I$5=\"Course 1\",Général!D$82,IF($I$5=\"Course 2\",Général!D$84,IF($I$5=\"Course 3\",Général!#REF!,Général!D$86)))","v":"Equipage 7"},{"$f":"IF($J$5=\"Course 1\",Général!D$90,IF($J$5=\"Course 2\",Général!D$92,IF($J$5=\"Course 3\",Général!#REF!,Général!D$94)))","v":"Equipage 5"},{"$f":"IF($K$5=\"Course 1\",Général!D$98,IF($K$5=\"Course 2\",Général!D$100,IF($K$5=\"Course 3\",Général!#REF!,Général!D$102)))","v":"Equipage 5"},{"$f":"IF($L$5=\"Course 1\",Général!D$106,IF($L$5=\"Course 2\",Général!D$108,IF($L$5=\"Course 3\",Général!#REF!,Général!D$110)))","v":"Equipage 5"},{"$f":"IF($M$5=\"Course 1\",Général!D$114,IF($M$5=\"Course 2\",Général!D$116,IF($M$5=\"Course 3\",Général!#REF!,Général!D$118)))","v":"Equipage 6"},{"$f":"IF($N$5=\"Course 1\",Général!D$122,IF($N$5=\"Course 2\",Général!D$124,IF($N$5=\"Course 3\",Général!#REF!,Général!D$126)))","v":"Equipage 7"},{"$f":"IF($O$5=\"Course 1\",Général!D$130,IF($O$5=\"Course 2\",Général!D$132,IF($O$5=\"Course 3\",Général!#REF!,Général!D$134)))","v":"Equipage 6"},{"$f":"IF($P$5=\"Course 1\",Général!D$138,IF($P$5=\"Course 2\",Général!D$140,IF($P$5=\"Course 3\",Général!#REF!,Général!D$142)))","v":"Equipage 6"},{"$f":"IF($Q$5=\"Course 1\",Général!D$146,IF($Q$5=\"Course 2\",Général!D$148,IF($Q$5=\"Course 3\",Général!#REF!,Général!D$150)))","v":"Equipage 2"},{"$f":"IF($R$5=\"Course 1\",Général!D$154,IF($R$5=\"Course 2\",Général!D$156,IF($R$5=\"Course 3\",Général!D$158,Général!D$160)))","v":"Equipage 2"},null,null,null,{"$f":"Général!B12","v":"Equipage 10"},6]
["4ème Equipage",null,{"$f":"IF($C$5=\"Course 1\",Général!E34,IF($C$5=\"Course 2\",Général!E36,IF($C$5=\"Course 3\",Général!#REF!,Général!E38)))","v":"Equipage 3"},{"$f":"IF($D$5=\"Course 1\",Général!E42,IF($D$5=\"Course 2\",Général!E44,IF($D$5=\"Course 3\",Général!#REF!,Général!E46)))","v":"Equipage 1"},{"$f":"IF($E$5=\"Course 1\",Général!E50,IF($E$5=\"Course 2\",Général!E52,IF($E$5=\"Course 3\",Général!#REF!,Général!E54)))","v":"Equipage 10"},{"$f":"IF($F$5=\"Course 1\",Général!E$58,IF($F$5=\"Course 2\",Général!E$60,IF($F$5=\"Course 3\",Général!#REF!,Général!E$62)))","v":"Equipage 5"},{"$f":"IF($G$5=\"Course 1\",Général!E$66,IF($G$5=\"Course 2\",Général!E$68,IF($G$5=\"Course 3\",Général!#REF!,Général!E$70)))","v":"Equipage 5"},{"$f":"IF($H$5=\"Course 1\",Général!E$74,IF($H$5=\"Course 2\",Général!E$76,IF($H$5=\"Course 3\",Général!#REF!,Général!E$78)))","v":"Equipage 10"},{"$f":"IF($I$5=\"Course 1\",Général!E$82,IF($I$5=\"Course 2\",Général!E$84,IF($I$5=\"Course 3\",Général!#REF!,Général!E$86)))","v":"Equipage 10"},{"$f":"IF($J$5=\"Course 1\",Général!E$90,IF($J$5=\"Course 2\",Général!E$92,IF($J$5=\"Course 3\",Général!#REF!,Général!E$94)))","v":"Equipage 4"},{"$f":"IF($K$5=\"Course 1\",Général!E$98,IF($K$5=\"Course 2\",Général!E$100,IF($K$5=\"Course 3\",Général!#REF!,Général!E$102)))","v":"Equipage 7"},{"$f":"IF($L$5=\"Course 1\",Général!E$106,IF($L$5=\"Course 2\",Général!E$108,IF($L$5=\"Course 3\",Général!#REF!,Général!E$110)))","v":"Equipage 7"},{"$f":"IF($M$5=\"Course 1\",Général!E$114,IF($M$5=\"Course 2\",Général!E$116,IF($M$5=\"Course 3\",Général!#REF!,Général!E$118)))","v":"Equipage 8"},{"$f":"IF($N$5=\"Course 1\",Général!E$122,IF($N$5=\"Course 2\",Général!E$124,IF($N$5=\"Course 3\",Général!#REF!,Général!E$126)))","v":"Equipage 1"},{"$f":"IF($O$5=\"Course 1\",Général!E$130,IF($O$5=\"Course 2\",Général!E$132,IF($O$5=\"Course 3\",Général!#REF!,Général!E$134)))","v":"Equipage 5"},{"$f":"IF($P$5=\"Course 1\",Général!E$138,IF($P$5=\"Course 2\",Général!E$140,IF($P$5=\"Course 3\",Général!#REF!,Général!E$142)))","v":"Equipage 5"},{"$f":"IF($Q$5=\"Course 1\",Général!E$146,IF($Q$5=\"Course 2\",Général!E$148,IF($Q$5=\"Course 3\",Général!#REF!,Général!E$150)))","v":"Equipage 4"},{"$f":"IF($R$5=\"Course 1\",Général!E$154,IF($R$5=\"Course 2\",Général!E$156,IF($R$5=\"Course 3\",Général!E$158,Général!E$160)))","v":"Equipage 5"}]
["5ème Equipage",null,{"$f":"IF($C$5=\"Course 1\",Général!F34,IF($C$5=\"Course 2\",Général!F36,IF($C$5=\"Course 3\",Général!#REF!,Général!F38)))","v":"Equipage 2"},{"$f":"IF($D$5=\"Course 1\",Général!F42,IF($D$5=\"Course 2\",Général!F44,IF($D$5=\"Course 3\",Général!#REF!,Général!F46)))","v":"Equipage 7"},{"$f":"IF($E$5=\"Course 1\",Général!F50,IF($E$5=\"Course 2\",Général!F52,IF($E$5=\"Course 3\",Général!#REF!,Général!F54)))","v":"Equipage 7"},{"$f":"IF($F$5=\"Course 1\",Général!F$58,IF($F$5=\"Course 2\",Général!F$60,IF($F$5=\"Course 3\",Général!#REF!,Général!F$62)))","v":"Equipage 1"},{"$f":"IF($G$5=\"Course 1\",Général!F$66,IF($G$5=\"Course 2\",Général!F$68,IF($G$5=\"Course 3\",Général!#REF!,Général!F$70)))","v":"Equipage 1"},{"$f":"IF($H$5=\"Course 1\",Général!F$74,IF($H$5=\"Course 2\",Général!F$76,IF($H$5=\"Course 3\",Général!#REF!,Général!F$78)))","v":"Equipage 5"},{"$f":"IF($I$5=\"Course 1\",Général!F$82,IF($I$5=\"Course 2\",Général!F$84,IF($I$5=\"Course 3\",Général!#REF!,Général!F$86)))","v":"Equipage 5"},{"$f":"IF($J$5=\"Course 1\",Général!F$90,IF($J$5=\"Course 2\",Général!F$92,IF($J$5=\"Course 3\",Général!#REF!,Général!F$94)))","v":"Equipage 7"},{"$f":"IF($K$5=\"Course 1\",Général!F$98,IF($K$5=\"Course 2\",Général!F$100,IF($K$5=\"Course 3\",Général!#REF!,Général!F$102)))","v":"Equipage 10"},{"$f":"IF($L$5=\"Course 1\",Général!F$106,IF($L$5=\"Course 2\",Général!$F108,IF($L$5=\"Course 3\",Général!#REF!,Général!F$110)))","v":"Equipage 2"},{"$f":"IF($M$5=\"Course 1\",Général!F$114,IF($M$5=\"Course 2\",Général!F$116,IF($M$5=\"Course 3\",Général!#REF!,Général!F$118)))","v":"Equipage 9"},{"$f":"IF($N$5=\"Course 1\",Général!F$122,IF($N$5=\"Course 2\",Général!F$124,IF($N$5=\"Course 3\",Général!#REF!,Général!F$126)))","v":"Equipage 4"},{"$f":"IF($O$5=\"Course 1\",Général!F$130,IF($O$5=\"Course 2\",Général!F$132,IF($O$5=\"Course 3\",Général!#REF!,Général!F$134)))","v":"Equipage 10"},{"$f":"IF($P$5=\"Course 1\",Général!F$138,IF($P$5=\"Course 2\",Général!F$140,IF($P$5=\"Course 3\",Général!#REF!,Général!F$142)))","v":"Equipage 8"},{"$f":"IF($Q$5=\"Course 1\",Général!F$146,IF($Q$5=\"Course 2\",Général!F$148,IF($Q$5=\"Course 3\",Général!#REF!,Général!F$150)))","v":"Equipage 5"},{"$f":"IF($R$5=\"Course 1\",Général!F$154,IF($R$5=\"Course 2\",Général!F$156,IF($R$5=\"Course 3\",Général!F$158,Général!F$160)))","v":"Equipage 8"}]
["7ème Equipage",null,{"$f":"IF($C$5=\"Course 1\",Général!H34,IF($C$5=\"Course 2\",Général!H36,IF($C$5=\"Course 3\",Général!#REF!,Général!H38)))","v":0},{"$f":"IF($D$5=\"Course 1\",Général!H42,IF($D$5=\"Course 2\",Général!H44,IF($D$5=\"Course 3\",Général!#REF!,Général!H46)))","v":0},{"$f":"IF($E$5=\"Course 1\",Général!H50,IF($E$5=\"Course 2\",Général!H52,IF($E$5=\"Course 3\",Général!#REF!,Général!H54)))","v":0},{"$f":"IF($F$5=\"Course 1\",Général!H$58,IF($F$5=\"Course 2\",Général!H$60,IF($F$5=\"Course 3\",Général!#REF!,Général!H$62)))","v":0},{"$f":"IF($G$5=\"Course 1\",Général!H$66,IF($G$5=\"Course 2\",Général!H$68,IF($G$5=\"Course 3\",Général!#REF!,Général!H$70)))","v":0},{"$f":"IF($H$5=\"Course 1\",Général!H$74,IF($H$5=\"Course 2\",Général!H$76,IF($H$5=\"Course 3\",Général!#REF!,Général!H$78)))","v":0},{"$f":"IF($I$5=\"Course 1\",Général!H$82,IF($I$5=\"Course 2\",Général!H$84,IF($I$5=\"Course 3\",Général!#REF!,Général!H$86)))","v":0},{"$f":"IF($J$5=\"Course 1\",Général!H$90,IF($J$5=\"Course 2\",Général!H$92,IF($J$5=\"Course 3\",Général!#REF!,Général!H$94)))","v":0},{"$f":"IF($K$5=\"Course 1\",Général!H$98,IF($K$5=\"Course 2\",Général!H$100,IF($K$5=\"Course 3\",Général!#REF!,Général!H$102)))","v":0},{"$f":"IF($L$5=\"Course 1\",Général!H$106,IF($L$5=\"Course 2\",Général!H$108,IF($L$5=\"Course 3\",Général!#REF!,Général!H$110)))","v":0},{"$f":"IF($M$5=\"Course 1\",Général!H$114,IF($M$5=\"Course 2\",Général!H$116,IF($M$5=\"Course 3\",Général!#REF!,Général!H$118)))","v":0},{"$f":"IF($N$5=\"Course 1\",Général!H$122,IF($N$5=\"Course 2\",Général!H$124,IF($N$5=\"Course 3\",Général!#REF!,Général!H$126)))","v":0},{"$f":"IF($O$5=\"Course 1\",Général!H$130,IF($O$5=\"Course 2\",Général!H$132,IF($O$5=\"Course 3\",Général!#REF!,Général!H$134)))","v":0},{"$f":"IF($P$5=\"Course 1\",Général!H$138,IF($P$5=\"Course 2\",Général!H$140,IF($P$5=\"Course 3\",Général!#REF!,Général!H$142)))","v":0},{"$f":"IF($Q$5=\"Course 1\",Général!H$146,IF($Q$5=\"Course 2\",Général!H$148,IF($Q$5=\"Course 3\",Général!#REF!,Général!H$150)))","v":0},{"$f":"IF($R$5=\"Course 1\",Général!H$154,IF($R$5=\"Course 2\",Général!H$156,IF($R$5=\"Course 3\",Général!H$158,Général!H$160)))","v":0},null,null,null,{"$f":"Général!B14","v":"Equipage 14"},{"$f":"COUNTIF($C$8:$R$16,V13)","v":0}]
["8ème Equipage",null,{"$f":"IF($C$5=\"Course 1\",Général!I34,IF($C$5=\"Course 2\",Général!I36,IF($C$5=\"Course 3\",Général!#REF!,Général!I38)))","v":0},{"$f":"IF($D$5=\"Course 1\",Général!I42,IF($D$5=\"Course 2\",Général!I44,IF($D$5=\"Course 3\",Général!#REF!,Général!I46)))","v":0},{"$f":"IF($E$5=\"Course 1\",Général!I50,IF($E$5=\"Course 2\",Général!I52,IF($E$5=\"Course 3\",Général!#REF!,Général!I54)))","v":0},{"$f":"IF($F$5=\"Course 1\",Général!I$58,IF($F$5=\"Course 2\",Général!I$60,IF($F$5=\"Course 3\",Général!#REF!,Général!I$62)))","v":0},{"$f":"IF($G$5=\"Course 1\",Général!I$66,IF($G$5=\"Course 2\",Général!I$68,IF($G$5=\"Course 3\",Général!#REF!,Général!I$70)))","v":0},{"$f":"IF($H$5=\"Course 1\",Général!I$74,IF($H$5=\"Course 2\",Général!I$76,IF($H$5=\"Course 3\",Général!#REF!,Général!I$78)))","v":0},{"$f":"IF($I$5=\"Course 1\",Général!I$82,IF($I$5=\"Course 2\",Général!I$84,IF($I$5=\"Course 3\",Général!#REF!,Général!I$86)))","v":0},{"$f":"IF($J$5=\"Course 1\",Général!I$90,IF($J$5=\"Course 2\",Général!I$92,IF($J$5=\"Course 3\",Général!#REF!,Général!I$94)))","v":0},{"$f":"IF($K$5=\"Course 1\",Général!I$98,IF($K$5=\"Course 2\",Général!I$100,IF($K$5=\"Course 3\",Général!#REF!,Général!I$102)))","v":0},{"$f":"IF($L$5=\"Course 1\",Général!I$106,IF($L$5=\"Course 2\",Général!I$108,IF($L$5=\"Course 3\",Général!#REF!,Général!I$110)))","v":0},{"$f":"IF($M$5=\"Course 1\",Général!I$114,IF($M$5=\"Course 2\",Général!I$116,IF($M$5=\"Course 3\",Général!#REF!,Général!I$118)))","v":0},{"$f":"IF($N$5=\"Course 1\",Général!I$122,IF($N$5=\"Course 2\",Général!I$124,IF($N$5=\"Course 3\",Général!#REF!,Général!I$126)))","v":0},{"$f":"IF($O$5=\"Course 1\",Général!I$130,IF($O$5=\"Course 2\",Général!I$132,IF($O$5=\"Course 3\",Général!#REF!,Général!I$134)))","v":0},{"$f":"IF($P$5=\"Course 1\",Général!I$138,IF($P$5=\"Course 2\",Général!I$140,IF($P$5=\"Course 3\",Général!#REF!,Général!I$142)))","v":0},{"$f":"IF($Q$5=\"Course 1\",Général!I$146,IF($Q$5=\"Course 2\",Général!I$148,IF($Q$5=\"Course 3\",Général!#REF!,Général!I$150)))","v":0},{"$f":"IF($R$5=\"Course 1\",Général!I$154,IF($R$5=\"Course 2\",Général!I$156,IF($R$5=\"Course 3\",Général!I$158,Général!I$160)))","v":0},null,null,null,{"$f":"Général!B15","v":"Equipage 15"},0]
["9ème Equipage",null,{"$f":"IF($C$5=\"Course 1\",Général!J34,IF($C$5=\"Course 2\",Général!J36,IF($C$5=\"Course 3\",Général!#REF!,Général!J38)))","v":0},{"$f":"IF($D$5=\"Course 1\",Général!J42,IF($D$5=\"Course 2\",Général!J44,IF($D$5=\"Course 3\",Général!#REF!,Général!J46)))","v":0},{"$f":"IF($E$5=\"Course 1\",Général!J50,IF($E$5=\"Course 2\",Général!J52,IF($E$5=\"Course 3\",Général!#REF!,Général!J54)))","v":0},{"$f":"IF($F$5=\"Course 1\",Général!J$58,IF($F$5=\"Course 2\",Général!J$60,IF($F$5=\"Course 3\",Général!#REF!,Général!J$62)))","v":0},{"$f":"IF($G$5=\"Course 1\",Général!J$66,IF($G$5=\"Course 2\",Général!J$68,IF($G$5=\"Course 3\",Général!#REF!,Général!J$70)))","v":0},{"$f":"IF($H$5=\"Course 1\",Général!J$74,IF($H$5=\"Course 2\",Général!J$76,IF($H$5=\"Course 3\",Général!#REF!,Général!J$78)))","v":0},{"$f":"IF($I$5=\"Course 1\",Général!J$82,IF($I$5=\"Course 2\",Général!J$84,IF($I$5=\"Course 3\",Général!#REF!,Général!J$86)))","v":0},{"$f":"IF($J$5=\"Course 1\",Général!J$90,IF($J$5=\"Course 2\",Général!J$92,IF($J$5=\"Course 3\",Général!#REF!,Général!J$94)))","v":0},{"$f":"IF($K$5=\"Course 1\",Général!J$98,IF($K$5=\"Course 2\",Général!J$100,IF($K$5=\"Course 3\",Général!#REF!,Général!J$102)))","v":0},{"$f":"IF($L$5=\"Course 1\",Général!J$106,IF($L$5=\"Course 2\",Général!J$108,IF($L$5=\"Course 3\",Général!#REF!,Général!J$110)))","v":0},{"$f":"IF($M$5=\"Course 1\",Général!J$114,IF($M$5=\"Course 2\",Général!J$116,IF($M$5=\"Course 3\",Général!#REF!,Général!J$118)))","v":0},{"$f":"IF($N$5=\"Course 1\",Général!J$122,IF($N$5=\"Course 2\",Général!J$124,IF($N$5=\"Course 3\",Général!#REF!,Général!J$126)))","v":0},{"$f":"IF($O$5=\"Course 1\",Général!J$130,IF($O$5=\"Course 2\",Général!J$132,IF($O$5=\"Course 3\",Général!#REF!,Général!J$134)))","v":0},{"$f":"IF($P$5=\"Course 1\",Général!J$138,IF($P$5=\"Course 2\",Général!J$140,IF($P$5=\"Course 3\",Général!#REF!,Général!J$142)))","v":0},{"$f":"IF($Q$5=\"Course 1\",Général!J$146,IF($Q$5=\"Course 2\",Général!J$148,IF($Q$5=\"Course 3\",Général!#REF!,Général!J$150)))","v":0},{"$f":"IF($R$5=\"Course 1\",Général!J$154,IF($R$5=\"Course 2\",Général!J$156,IF($R$5=\"Course 3\",Général!J$158,Général!J$160)))","v":0},null,null,null,{"$f":"Général!B16","v":"Equipage 16"},0]
["10ème Equipage",null,{"$f":"IF($C$5=\"Course 1\",Général!K34,IF($C$5=\"Course 2\",Général!K36,IF($C$5=\"Course 3\",Général!#REF!,Général!K38)))","v":0},{"$f":"IF($D$5=\"Course 1\",Général!K42,IF($D$5=\"Course 2\",Général!K44,IF($D$5=\"Course 3\",Général!#REF!,Général!K46)))","v":0},{"$f":"IF($E$5=\"Course 1\",Général!K50,IF($E$5=\"Course 2\",Général!K52,IF($E$5=\"Course 3\",Général!#REF!,Général!K54)))","v":0},{"$f":"IF($F$5=\"Course 1\",Général!K$58,IF($F$5=\"Course 2\",Général!K$60,IF($F$5=\"Course 3\",Général!#REF!,Général!K$62)))","v":0},{"$f":"IF($G$5=\"Course 1\",Général!K$66,IF($G$5=\"Course 2\",Général!K$68,IF($G$5=\"Course 3\",Général!#REF!,Général!K$70)))","v":0},{"$f":"IF($H$5=\"Course 1\",Général!K$74,IF($H$5=\"Course 2\",Général!K$76,IF($H$5=\"Course 3\",Général!#REF!,Général!K$78)))","v":0},{"$f":"IF($I$5=\"Course 1\",Général!K$82,IF($I$5=\"Course 2\",Général!K$84,IF($I$5=\"Course 3\",Général!#REF!,Général!K$86)))","v":0},{"$f":"IF($J$5=\"Course 1\",Général!K$90,IF($J$5=\"Course 2\",Général!K$92,IF($J$5=\"Course 3\",Général!#REF!,Général!K$94)))","v":0},{"$f":"IF($K$5=\"Course 1\",Général!K$98,IF($K$5=\"Course 2\",Général!K$100,IF($K$5=\"Course 3\",Général!#REF!,Général!K$102)))","v":0},{"$f":"IF($L$5=\"Course 1\",Général!K$106,IF($L$5=\"Course 2\",Général!K$108,IF($L$5=\"Course 3\",Général!#REF!,Général!K$110)))","v":0},{"$f":"IF($M$5=\"Course 1\",Général!K$114,IF($M$5=\"Course 2\",Général!K$116,IF($M$5=\"Course 3\",Général!#REF!,Général!K$118)))","v":0},{"$f":"IF($N$5=\"Course 1\",Général!K$122,IF($N$5=\"Course 2\",Général!K$124,IF($N$5=\"Course 3\",Général!#REF!,Général!K$126)))","v":0},{"$f":"IF($O$5=\"Course 1\",Général!K$130,IF($O$5=\"Course 2\",Général!K$132,IF($O$5=\"Course 3\",Général!#REF!,Général!K$134)))","v":0},{"$f":"IF($P$5=\"Course 1\",Général!K$138,IF($P$5=\"Course 2\",Général!K$140,IF($P$5=\"Course 3\",Général!#REF!,Général!K$142)))","v":0},{"$f":"IF($Q$5=\"Course 1\",Général!K$146,IF($Q$5=\"Course 2\",Général!K$148,IF($Q$5=\"Course 3\",Général!#REF!,Général!K$150)))","v":0},{"$f":"IF($R$5=\"Course 1\",Général!K$154,IF($R$5=\"Course 2\",Général!K$156,IF($R$5=\"Course 3\",Général!K$158,Général!K$160)))","v":0},null,null,null,{"$f":"Général!B17","v":"Equipage 17"},0]
[null,null,null,null,null,null,null,null,null,null,null,null,null,null,null,null,null,null,null,null,null,{"$f":"Général!B18","v":"Equipage 18"},0]
[null,null,null,null,null,null,null,null,null,null,null,null,null,null,null,null,null,null,null,null,null,{"$f":"Général!B19","v":"Equipage 19"},0]
[null,null,null,null,null,null,null,null,null,null,null,null,null,null,null,null,null,null,null,null,null,{"$f":"Général!B20","v":"Equipage 20"},0]
[null,null,null,null,null,null,null,null,null,null,null,null,null,null,null,null,null,null,null,null,null,{"$f":"Général!B21","v":"Equipage 21"},0]
[null,null,null,null,null,null,null,null,null,null,null,null,null,null,null,null,null,null,null,null,null,{"$f":"Général!B22","v":"Equipage 22"},0]
[null,null,null,null,null,null,null,null,null,null,null,null,null,null,null,null,null,null,null,null,null,{"$f":"Général!B23","v":"Equipage 23"},0]
[null,null,null,null,null,null,null,null,null,null,null,null,null,null,null,null,null,null,null,null,null,{"$f":"Général!B24","v":"Equipage 24"},0]
[null,null,null,null,null,null,null,null,null,null,null,null,null,null,null,null,null,null,null,null,null,{"$f":"Général!B25","v":"Equipage 25"},0]
[null,null,null,null,null,null,null,null,null,null,null,null,null,null,null,null,null,null,null,null,null,{"$f":"Général!B26","v":"Equipage 26"},0]
[null,null,null,null,null,null,null,null,null,null,null,null,null,null,null,null,null,null,null,null,null,{"$f":"Général!B27","v":"Equipage 27"},0]
[null,null,null,null,null,null,null,null,null,null,null,null,null,null,null,null,null,null,null,null,null,{"$f":"Général!B28","v":"Equipage 28"},0]
[null,null,null,null,null,null,null,null,null,null,null,null,null,null,null,null,null,null,null,null,null,{"$f":"Général!B29","v":"Equipage 29"},0]
[null,null,null,null,null,null,null,null,null,null,null,null,null,null,null,null,null,null,null,null,null,{"$f":"Général!B30","v":"Equipage 30"},0]

{"sheet":"Eq.6","index":11,"n_rows":29,"n_cols":23,"rows_kept":29,"cut":false,"hidden":true,"merged":[[7,0,7,1],[0,0,1,5],[0,6,1,10],[3,0,3,1],[4,0,4,1],[5,0,5,1],[14,0,14,1],[15,0,15,1],[8,0,8,1],[9,0,9,1],[10,0,10,1],[11,0,11,1],[12,0,12,1],[13,0,13,1]]}
["Equipage ",null,null,null,null,null,{"$f":"Général!B8","v":"Equipage 6"},null,null,null,null,null,null,null,null,null,null,null,null,null,null,{"$f":"Général!B3","v":"Equipage 1"},{"$f":"COUNTIF(C$8:R$16,V1)","v":6}]
[null,null,null,null,null,null,null,null,null,null,null,null,null,null,null,null,null,null,null,null,null,{"$f":"Général!B4","v":"Equipage 2"},{"$f":"COUNTIF($C$8:$R$16,V2)","v":9}]
[null,null,null,null,null,null,null,null,null,null,null,null,null,null,null,null,null,null,null,null,null,{"$f":"Général!B5","v":"Equipage 3"},8]
[null,null,"FLIGHT 1","FLIGHT 2","FLIGHT 3","FLIGHT 4","FLIGHT 5","FLIGHT 6","FLIGHT 7","FLIGHT 8","FLIGHT 9","FLIGHT 10","FLIGHT 11","FLIGHT 12","FLIGHT 13","FLIGHT 14","FLIGHT 15","FLIGHT 16","FLIGHT 17","FLIGHT 18",null,{"$f":"Général!B6","v":"Equipage 4"},6]
["N° de course",null,{"$f":"IF(COUNTIF(Général!B34:K34,$G$1)=1,\"Course 1\",IF(COUNTIF(Général!B36:K36,$G$1)=1,\"Course 2\",IF(COUNTIF(Général!#REF!,$G$1)=1,\"Course 3\",\"Course 4\")))","v":"Course 1"},{"$f":"IF(COUNTIF(Général!B42:K42,$G$1)=1,\"Course 1\",IF(COUNTIF(Général!B44:K44,$G$1)=1,\"Course 2\",IF(COUNTIF(Général!#REF!,$G$1)=1,\"Course 3\",\"Course 4\")))","v":"Course 1"},{"$f":"IF(COUNTIF(Général!B50:K50,$G$1)=1,\"Course 1\",IF(COUNTIF(Général!B52:K52,$G$1)=1,\"Course 2\",IF(COUNTIF(Général!#REF!,$G$1)=1,\"Course 3\",\"Course 4\")))","v":"Course 2"},{"$f":"IF(COUNTIF(Général!B58:K58,$G$1)=1,\"Course 1\",IF(COUNTIF(Général!B60:K60,$G$1)=1,\"Course 2\",IF(COUNTIF(Général!#REF!,$G$1)=1,\"Course 3\",\"Course 4\")))","v":"Course 1"},{"$f":"IF(COUNTIF(Général!B66:K66,$G$1)=1,\"Course 1\",IF(COUNTIF(Général!B68:K68,$G$1)=1,\"Course 2\",IF(COUNTIF(Général!#REF!,$G$1)=1,\"Course 3\",\"Course 4\")))","v":"Course 1"},{"$f":"IF(COUNTIF(Général!B74:K74,$G$1)=1,\"Course 1\",IF(COUNTIF(Général!B76:K76,$G$1)=1,\"Course 2\",IF(COUNTIF(Général!#REF!,$G$1)=1,\"Course 3\",\"Course 4\")))","v":"Course 1"},{"$f":"IF(COUNTIF(Général!B82:K82,$G$1)=1,\"Course 1\",IF(COUNTIF(Général!B84:K84,$G$1)=1,\"Course 2\",IF(COUNTIF(Général!#REF!,$G$1)=1,\"Course 3\",\"Course 4\")))","v":"Course 2"},{"$f":"IF(COUNTIF(Général!B90:K90,$G$1)=1,\"Course 1\",IF(COUNTIF(Général!B92:K92,$G$1)=1,\"Course 2\",IF(COUNTIF(Général!#REF!,$G$1)=1,\"Course 3\",\"Course 4\")))","v":"Course 1"},{"$f":"IF(COUNTIF(Général!B98:K98,$G$1)=1,\"Course 1\",IF(COUNTIF(Général!B100:K100,$G$1)=1,\"Course 2\",IF(COUNTIF(Général!#REF!,$G$1)=1,\"Course 3\",\"Course 4\")))","v":"Course 1"},{"$f":"IF(COUNTIF(Général!B106:K106,$G$1)=1,\"Course 1\",IF(COUNTIF(Général!B108:K108,$G$1)=1,\"Course 2\",IF(COUNTIF(Général!#REF!,$G$1)=1,\"Course 3\",\"Course 4\")))","v":"Course 1"},{"$f":"IF(COUNTIF(Général!B114:K114,$G$1)=1,\"Course 1\",IF(COUNTIF(Général!B116:K116,$G$1)=1,\"Course 2\",IF(COUNTIF(Général!#REF!,$G$1)=1,\"Course 3\",\"Course 4\")))","v":"Course 1"},{"$f":"IF(COUNTIF(Général!B122:K122,$G$1)=1,\"Course 1\",IF(COUNTIF(Général!B124:K124,$G$1)=1,\"Course 2\",IF(COUNTIF(Général!#REF!,$G$1)=1,\"Course 3\",\"Course 4\")))","v":"Course 1"},{"$f":"IF(COUNTIF(Général!B130:K130,$G$1)=1,\"Course 1\",IF(COUNTIF(Général!B132:K132,$G$1)=1,\"Course 2\",IF(COUNTIF(Général!#REF!,$G$1)=1,\"Course 3\",\"Course 4\")))","v":"Course 2"},{"$f":"IF(COUNTIF(Général!B138:K138,$G$1)=1,\"Course 1\",IF(COUNTIF(Général!B140:K140,$G$1)=1,\"Course 2\",IF(COUNTIF(Général!#REF!,$G$1)=1,\"Course 3\",\"Course 4\")))","v":"Course 1"},{"$f":"IF(COUNTIF(Général!B146:K146,$G$1)=1,\"Course 1\",IF(COUNTIF(Général!B148:K148,$G$1)=1,\"Course 2\",IF(COUNTIF(Général!#REF!,$G$1)=1,\"Course 3\",\"Course 4\")))","v":"Course 2"},{"$f":"IF(COUNTIF(Général!B154:K154,$G$1)=1,\"Course 1\",IF(COUNTIF(Général!B156:K156,$G$1)=1,\"Course 2\",IF(COUNTIF(Général!B158:K158,$G$1)=1,\"Course 3\",\"Course 4\")))","v":"Course 1"},{"$f":"IF(COUNTIF(Général!C154:L154,$G$1)=1,\"Course 1\",IF(COUNTIF(Général!C156:L156,$G$1)=1,\"Course 2\",IF(COUNTIF(Général!C158:L158,$G$1)=1,\"Course 3\",\"Course 4\")))","v":"Course 1"},{"$f":"IF(COUNTIF(Général!D154:M154,$G$1)=1,\"Course 1\",IF(COUNTIF(Général!D156:M156,$G$1)=1,\"Course 2\",IF(COUNTIF(Général!D158:M158,$G$1)=1,\"Course 3\",\"Course 4\")))","v":"Course 1"},null,{"$f":"Général!B7","v":"Equipage 5"},5]
["Bateau",null,{"$f":"IF(COUNTIF(Général!B34:B38,$G$1)=1,\"Boat 1\",IF(COUNTIF(Général!C34:C38,$G$1)=1,\"Boat 2\",IF(COUNTIF(Général!D34:D38,$G$1)=1,\"Boat 3\",IF(COUNTIF(Général!E34:E38,$G$1)=1,\"Boat 4\",IF(COUNTIF(Général!F34:F38,$G$1)=1,\"Boat 5\",IF(COUNTIF(Général!G34:G38,$G$1)=1,\"Boat 6\",IF(COUNTIF(Général!H34:H38,$G$1)=1,\"Boat 7\",IF(COUNTIF(Général!I34:I38,$G$1)=1,\"Boat 8\",IF(COUNTIF(Général!J34:J38,$G$1)=1,\"Boat 9\",\"Boat10\")))))))))","v":"Boat 4"},{"$f":"IF(COUNTIF(Général!B42:B46,$G$1)=1,\"Boat 1\",IF(COUNTIF(Général!C42:C46,$G$1)=1,\"Boat 2\",IF(COUNTIF(Général!D42:D46,$G$1)=1,\"Boat 3\",IF(COUNTIF(Général!E42:E46,$G$1)=1,\"Boat 4\",IF(COUNTIF(Général!F42:F46,$G$1)=1,\"Boat 5\",IF(COUNTIF(Général!G42:G46,$G$1)=1,\"Boat 6\",IF(COUNTIF(Général!H42:H46,$G$1)=1,\"Boat 7\",IF(COUNTIF(Général!I42:I46,$G$1)=1,\"Boat 8\",IF(COUNTIF(Général!J42:J46,$G$1)=1,\"Boat 9\",\"Boat 10\")))))))))","v":"Boat 5"},{"$f":"IF(COUNTIF(Général!B50:B54,$G$1)=1,\"Boat 1\",IF(COUNTIF(Général!C50:C54,$G$1)=1,\"Boat 2\",IF(COUNTIF(Général!D50:D54,$G$1)=1,\"Boat 3\", IF(COUNTIF(Général!E50:E54,$G$1)=1,\"Boat 4\", IF(COUNTIF(Général!F50:F54,$G$1)=1,\"Boat 5\", IF(COUNTIF(Général!G50:G54,$G$1)=1,\"Boat 6\", IF(COUNTIF(Général!H50:H54,$G$1)=1,\"Boat 7\",IF(COUNTIF(Général!I50:I54,$G$1)=1,\"Boat 8\",IF(COUNTIF(Général!J50:J54,$G$1)=1,\"Boat 9\",\"Boat 10\")))))))))","v":"Boat 5"},{"$f":"IF(COUNTIF(Général!B58:B62,$G$1)=1,\"Boat 1\",IF(COUNTIF(Général!C58:C62,$G$1)=1,\"Boat 2\",IF(COUNTIF(Général!D58:D62,$G$1)=1,\"Boat 3\", IF(COUNTIF(Général!E58:E62,$G$1)=1,\"Boat 4\", IF(COUNTIF(Général!F58:F62,$G$1)=1,\"Boat 5\", IF(COUNTIF(Général!G58:G62,$G$1)=1,\"Boat 6\", IF(COUNTIF(Général!H58:H62,$G$1)=1,\"Boat 7\",IF(COUNTIF(Général!I58:I62,$G$1)=1,\"Boat 8\",IF(COUNTIF(Général!I58:J62,$G$1)=1,\"Boat 9\",\"Boat 10\")))))))))","v":"Boat 5"},{"$f":"IF(COUNTIF(Général!B66:B70,$G$1)=1,\"Boat 1\",IF(COUNTIF(Général!C66:C70,$G$1)=1,\"Boat 2\",IF(COUNTIF(Général!D66:D70,$G$1)=1,\"Boat 3\", IF(COUNTIF(Général!E66:E70,$G$1)=1,\"Boat 4\", IF(COUNTIF(Général!F66:F70,$G$1)=1,\"Boat 5\", IF(COUNTIF(Général!G66:G70,$G$1)=1,\"Boat 6\", IF(COUNTIF(Général!H66:H70,$G$1)=1,\"Boat 7\",IF(COUNTIF(Général!I66:I70,$G$1)=1,\"Boat 8\",IF(COUNTIF(Général!J66:J70,$G$1)=1,\"Boat 9\",\"Boat 10\")))))))))","v":"Boat 3"},{"$f":"IF(COUNTIF(Général!B74:B78,$G$1)=1,\"Boat 1\",IF(COUNTIF(Général!C74:C78,$G$1)=1,\"Boat 2\",IF(COUNTIF(Général!D74:D78,$G$1)=1,\"Boat 3\", IF(COUNTIF(Général!E74:E78,$G$1)=1,\"Boat 4\", IF(COUNTIF(Général!F74:F78,$G$1)=1,\"Boat 5\", IF(COUNTIF(Général!G74:G78,$G$1)=1,\"Boat 6\", IF(COUNTIF(Général!H74:H78,$G$1)=1,\"Boat 7\",IF(COUNTIF(Général!I74:I78,$G$1)=1,\"Boat 8\",IF(COUNTIF(Général!J74:J78,$G$1)=1,\"Boat 9\",\"Boat 10\")))))))))","v":"Boat 4"},{"$f":"IF(COUNTIF(Général!B82:B86,$G$1)=1,\"Boat 1\",IF(COUNTIF(Général!C82:C86,$G$1)=1,\"Boat 2\",IF(COUNTIF(Général!D82:D86,$G$1)=1,\"Boat 3\", IF(COUNTIF(Général!E82:E86,$G$1)=1,\"Boat 4\", IF(COUNTIF(Général!F82:F86,$G$1)=1,\"Boat 5\", IF(COUNTIF(Général!G82:G86,$G$1)=1,\"Boat 6\", IF(COUNTIF(Général!H82:H86,$G$1)=1,\"Boat 7\",IF(COUNTIF(Général!I82:I86,$G$1)=1,\"Boat 8\",IF(COUNTIF(Général!J82:J86,$G$1)=1,\"Boat 9\",\"Boat 10\")))))))))","v":"Boat 1"},{"$f":"IF(COUNTIF(Général!B90:B94,$G$1)=1,\"Boat 1\",IF(COUNTIF(Général!C90:C94,$G$1)=1,\"Boat 2\",IF(COUNTIF(Général!D90:D94,$G$1)=1,\"Boat 3\", IF(COUNTIF(Général!E90:E94,$G$1)=1,\"Boat 4\", IF(COUNTIF(Général!F90:F94,$G$1)=1,\"Boat 5\", IF(COUNTIF(Général!G90:G94,$G$1)=1,\"Boat 6\", IF(COUNTIF(Général!H90:H94,$G$1)=1,\"Boat 7\",IF(COUNTIF(Général!I90:I94,$G$1)=1,\"Boat 8\",IF(COUNTIF(Général!J90:J94,$G$1)=1,\"Boat 9\",\"Boat 10\")))))))))","v":"Boat 1"},{"$f":"IF(COUNTIF(Général!B98:B102,$G$1)=1,\"Boat 1\",IF(COUNTIF(Général!C98:C102,$G$1)=1,\"Boat 2\",IF(COUNTIF(Général!D98:D102,$G$1)=1,\"Boat 3\", IF(COUNTIF(Général!E98:E102,$G$1)=1,\"Boat 4\", IF(COUNTIF(Général!F98:F102,$G$1)=1,\"Boat 5\", IF(COUNTIF(Général!G98:G102,$G$1)=1,\"Boat 6\", IF(COUNTIF(Général!H98:H102,$G$1)=1,\"Boat 7\",IF(COUNTIF(Général!I98:I102,$G$1)=1,\"Boat 8\",IF(COUNTIF(Général!J98:J102,$G$1)=1,\"Boat 9\",\"Boat 10\")))))))))","v":"Boat 1"},{"$f":"IF(COUNTIF(Général!B106:B110,$G$1)=1,\"Boat 1\",IF(COUNTIF(Général!C106:C110,$G$1)=1,\"Boat 2\",IF(COUNTIF(Général!D106:D110,$G$1)=1,\"Boat 3\", IF(COUNTIF(Général!E106:E110,$G$1)=1,\"Boat 4\", IF(COUNTIF(Général!F106:F110,$G$1)=1,\"Boat 5\", IF(COUNTIF(Général!G106:G110,$G$1)=1,\"Boat 6\", IF(COUNTIF(Général!H106:H110,$G$1)=1,\"Boat 7\",IF(COUNTIF(Général!I106:I110,$G$1)=1,\"Boat 8\",IF(COUNTIF(Général!J106:J110,$G$1)=1,\"Boat 9\",\"Boat 10\")))))))))","v":"Boat 2"},{"$f":"IF(COUNTIF(Général!B114:B118,$G$1)=1,\"Boat 1\",IF(COUNTIF(Général!C114:C118,$G$1)=1,\"Boat 2\",IF(COUNTIF(Général!C114:D118,$G$1)=1,\"Boat 3\", IF(COUNTIF(Général!C114:E118,$G$1)=1,\"Boat 4\", IF(COUNTIF(Général!F114:F118,$G$1)=1,\"Boat 5\", IF(COUNTIF(Général!G114:G118,$G$1)=1,\"Boat 6\", IF(COUNTIF(Général!H114:H118,$G$1)=1,\"Boat 7\",IF(COUNTIF(Général!I114:I118,$G$1)=1,\"Boat 8\",IF(COUNTIF(Général!J114:J118,$G$1)=1,\"Boat 9\",\"Boat 10\")))))))))","v":"Boat 3"},{"$f":"IF(COUNTIF(Général!B122:B126,$G$1)=1,\"Boat 1\",IF(COUNTIF(Général!C122:C126,$G$1)=1,\"Boat 2\",IF(COUNTIF(Général!D122:D126,$G$1)=1,\"Boat 3\", IF(COUNTIF(Général!E122:E126,$G$1)=1,\"Boat 4\", IF(COUNTIF(Général!F122:F126,$G$1)=1,\"Boat 5\", IF(COUNTIF(Général!G122:G126,$G$1)=1,\"Boat 6\", IF(COUNTIF(Général!H122:H126,$G$1)=1,\"Boat 7\",IF(COUNTIF(Général!I122:I126,$G$1)=1,\"Boat 8\",IF(COUNTIF(Général!J122:J126,$G$1)=1,\"Boat 9\",\"Boat 10\")))))))))","v":"Boat 2"},{"$f":"IF(COUNTIF(Général!B130:B134,$G$1)=1,\"Boat 1\",IF(COUNTIF(Général!C130:C134,$G$1)=1,\"Boat 2\",IF(COUNTIF(Général!D130:D134,$G$1)=1,\"Boat 3\", IF(COUNTIF(Général!E130:E134,$G$1)=1,\"Boat 4\", IF(COUNTIF(Général!F130:F134,$G$1)=1,\"Boat 5\", IF(COUNTIF(Général!G130:G134,$G$1)=1,\"Boat 6\", IF(COUNTIF(Général!H130:H134,$G$1)=1,\"Boat 7\",IF(COUNTIF(Général!I130:I134,$G$1)=1,\"Boat 8\",IF(COUNTIF(Général!J130:J134,$G$1)=1,\"Boat 9\",\"Boat 10\")))))))))","v":"Boat 3"},{"$f":"IF(COUNTIF(Général!B138:B142,$G$1)=1,\"Boat 1\",IF(COUNTIF(Général!C138:C142,$G$1)=1,\"Boat 2\",IF(COUNTIF(Général!D138:D142,$G$1)=1,\"Boat 3\", IF(COUNTIF(Général!E138:E142,$G$1)=1,\"Boat 4\", IF(COUNTIF(Général!F138:F142,$G$1)=1,\"Boat 5\", IF(COUNTIF(Général!G138:G142,$G$1)=1,\"Boat 6\", IF(COUNTIF(Général!H138:H142,$G$1)=1,\"Boat 7\",IF(COUNTIF(Général!I138:I142,$G$1)=1,\"Boat 8\",IF(COUNTIF(Général!J138:J142,$G$1)=1,\"Boat 9\",\"Boat 10\")))))))))","v":"Boat 3"},{"$f":"IF(COUNTIF(Général!B146:B150,$G$1)=1,\"Boat 1\",IF(COUNTIF(Général!C146:C150,$G$1)=1,\"Boat 2\",IF(COUNTIF(Général!D146:D150,$G$1)=1,\"Boat 3\", IF(COUNTIF(Général!E146:E150,$G$1)=1,\"Boat 4\", IF(COUNTIF(Général!F146:F150,$G$1)=1,\"Boat 5\", IF(COUNTIF(Général!G146:G150,$G$1)=1,\"Boat 6\", IF(COUNTIF(Général!H146:H150,$G$1)=1,\"Boat 7\",IF(COUNTIF(Général!I146:I150,$G$1)=1,\"Boat 8\",IF(COUNTIF(Général!J146:J150,$G$1)=1,\"Boat 9\",\"Boat 10\")))))))))","v":"Boat 4"},{"$f":"IF(COUNTIF(Général!B154:B157,$G$1)=1,\"Boat 1\",IF(COUNTIF(Général!C154:C157,$G$1)=1,\"Boat 2\",IF(COUNTIF(Général!D154:D157,$G$1)=1,\"Boat 3\", IF(COUNTIF(Général!E154:E157,$G$1)=1,\"Boat 4\", IF(COUNTIF(Général!F154:F157,$G$1)=1,\"Boat 5\", IF(COUNTIF(Général!G154:G157,$G$1)=1,\"Boat 6\", IF(COUNTIF(Général!H154:H157,$G$1)=1,\"Boat 7\",IF(COUNTIF(Général!I154:I157,$G$1)=1,\"Boat 8\",IF(COUNTIF(Général!J154:J157,$G$1)=1,\"Boat 9\",\"Boat 10\")))))))))","v":"Boat 4"},{"$f":"IF(COUNTIF(Général!B160:B163,$G$1)=1,\"Boat 1\",IF(COUNTIF(Général!C160:C163,$G$1)=1,\"Boat 2\",IF(COUNTIF(Général!D160:D163,$G$1)=1,\"Boat 3\", IF(COUNTIF(Général!E160:E163,$G$1)=1,\"Boat 4\", IF(COUNTIF(Général!F160:F163,$G$1)=1,\"Boat 5\", IF(COUNTIF(Général!G160:G163,$G$1)=1,\"Boat 6\", IF(COUNTIF(Général!H160:H163,$G$1)=1,\"Boat 7\",IF(COUNTIF(Général!I160:I163,$G$1)=1,\"Boat 8\",IF(COUNTIF(Général!J160:J163,$G$1)=1,\"Boat 9\",\"Boat 10\")))))))))","v":"Boat 4"},{"$f":"IF(COUNTIF(Général!B166:B169,$G$1)=1,\"Boat 1\",IF(COUNTIF(Général!C166:C169,$G$1)=1,\"Boat 2\",IF(COUNTIF(Général!D166:D169,$G$1)=1,\"Boat 3\", IF(COUNTIF(Général!E166:E169,$G$1)=1,\"Boat 4\", IF(COUNTIF(Général!F166:F169,$G$1)=1,\"Boat 5\", IF(COUNTIF(Général!G166:G169,$G$1)=1,\"Boat 6\", IF(COUNTIF(Général!H166:H169,$G$1)=1,\"Boat 7\",IF(COUNTIF(Général!I166:I169,$G$1)=1,\"Boat 8\",IF(COUNTIF(Général!J166:J169,$G$1)=1,\"Boat 9\",\"Boat 10\")))))))))","v":"Boat 4"},null,{"$f":"Général!B8","v":"Equipage 6"},16]
[null,null,null,null,null,null,null,null,null,null,null,null,null,null,null,null,null,null,null,null,null,{"$f":"Général!B9","v":"Equipage 7"},9]
["1er Equipage",null,{"$f":"IF($C$5=\"Course 1\",Général!B34,IF($C$5=\"Course 2\",Général!B36,IF($C$5=\"Course 3\",Général!#REF!,Général!B38)))","v":"Equipage 7"},{"$f":"IF($D$5=\"Course 1\",Général!B42,IF($D$5=\"Course 2\",Général!B44,IF($D$5=\"Course 3\",Général!#REF!,Général!B46)))","v":"Equipage 8"},{"$f":"IF($E$5=\"Course 1\",Général!B50,IF($E$5=\"Course 2\",Général!B52,IF($E$5=\"Course 3\",Général!#REF!,Général!B54)))","v":"Equipage 1"},{"$f":"IF($F$5=\"Course 1\",Général!B$58,IF($F$5=\"Course 2\",Général!B$60,IF($F$5=\"Course 3\",Général!#REF!,Général!B$62)))","v":"Equipage 10"},{"$f":"IF($G$5=\"Course 1\",Général!B$66,IF($G$5=\"Course 2\",Général!B$68,IF($G$5=\"Course 3\",Général!#REF!,Général!B$70)))","v":"Equipage 2"},{"$f":"IF($H$5=\"Course 1\",Général!B$74,IF($H$5=\"Course 2\",Général!B$76,IF($H$5=\"Course 3\",Général!#REF!,Général!B$78)))","v":"Equipage 3"},{"$f":"IF($I$5=\"Course 1\",Général!B$82,IF($I$5=\"Course 2\",Général!B$84,IF($I$5=\"Course 3\",Général!#REF!,Général!B$86)))","v":"Equipage 6"},{"$f":"IF($J$5=\"Course 1\",Général!B$90,IF($J$5=\"Course 2\",Général!B$92,IF($J$5=\"Course 3\",Général!#REF!,Général!B$94)))","v":"Equipage 6"},{"$f":"IF($K$5=\"Course 1\",Général!B$98,IF($K$5=\"Course 2\",Général!B$100,IF($K$5=\"Course 3\",Général!#REF!,Général!B$102)))","v":"Equipage 6"},{"$f":"IF($L$5=\"Course 1\",Général!B$106,IF($L$5=\"Course 2\",Général!B$108,IF($L$5=\"Course 3\",Général!#REF!,Général!B$110)))","v":"Equipage 3"},{"$f":"IF($M$5=\"Course 1\",Général!B$114,IF($M$5=\"Course 2\",Général!B$116,IF($M$5=\"Course 3\",Général!#REF!,Général!B$118)))","v":"Equipage 5"},{"$f":"IF($N$5=\"Course 1\",Général!B$122,IF($N$5=\"Course 2\",Général!B$124,IF($N$5=\"Course 3\",Général!#REF!,Général!B$126)))","v":"Equipage 9"},{"$f":"IF($O$5=\"Course 1\",Général!B$130,IF($O$5=\"Course 2\",Général!B$132,IF($O$5=\"Course 3\",Général!#REF!,Général!B$134)))","v":"Equipage 4"},{"$f":"IF($P$5=\"Course 1\",Général!B$138,IF($P$5=\"Course 2\",Général!B$140,IF($P$5=\"Course 3\",Général!#REF!,Général!B$142)))","v":"Equipage 9"},{"$f":"IF($Q$5=\"Course 1\",Général!B$146,IF($Q$5=\"Course 2\",Général!B$148,IF($Q$5=\"Course 3\",Général!#REF!,Général!B$150)))","v":"Equipage 9"},{"$f":"IF($R$5=\"Course 1\",Général!B$154,IF($R$5=\"Course 2\",Général!B$156,IF($R$5=\"Course 3\",Général!B$158,Général!B$160)))","v":"Equipage 1"},null,null,null,{"$f":"Général!B10","v":"Equipage 8"},3]
["2nd Equipage",null,{"$f":"IF($C$5=\"Course 1\",Général!C34,IF($C$5=\"Course 2\",Général!C36,IF($C$5=\"Course 3\",Général!#REF!,Général!C38)))","v":"Equipage 10"},{"$f":"IF($D$5=\"Course 1\",Général!C42,IF($D$5=\"Course 2\",Général!C44,IF($D$5=\"Course 3\",Général!#REF!,Général!C46)))","v":"Equipage 4"},{"$f":"IF($E$5=\"Course 1\",Général!C50,IF($E$5=\"Course 2\",Général!C52,IF($E$5=\"Course 3\",Général!#REF!,Général!C54)))","v":"Equipage 2"},{"$f":"IF($F$5=\"Course 1\",Général!C$58,IF($F$5=\"Course 2\",Général!C$60,IF($F$5=\"Course 3\",Général!#REF!,Général!C$62)))","v":"Equipage 7"},{"$f":"IF($G$5=\"Course 1\",Général!C$66,IF($G$5=\"Course 2\",Général!C$68,IF($G$5=\"Course 3\",Général!#REF!,Général!C$70)))","v":"Equipage 3"},{"$f":"IF($H$5=\"Course 1\",Général!C$74,IF($H$5=\"Course 2\",Général!C$76,IF($H$5=\"Course 3\",Général!#REF!,Général!C$78)))","v":"Equipage 7"},{"$f":"IF($I$5=\"Course 1\",Général!C$82,IF($I$5=\"Course 2\",Général!C$84,IF($I$5=\"Course 3\",Général!#REF!,Général!C$86)))","v":"Equipage 9"},{"$f":"IF($J$5=\"Course 1\",Général!C$90,IF($J$5=\"Course 2\",Général!C$92,IF($J$5=\"Course 3\",Général!#REF!,Général!C$94)))","v":"Equipage 9"},{"$f":"IF($K$5=\"Course 1\",Général!C$98,IF($K$5=\"Course 2\",Général!C$100,IF($K$5=\"Course 3\",Général!#REF!,Général!C$102)))","v":"Equipage 1"},{"$f":"IF($L$5=\"Course 1\",Général!C$106,IF($L$5=\"Course 2\",Général!C$108,IF($L$5=\"Course 3\",Général!#REF!,Général!C$110)))","v":"Equipage 6"},{"$f":"IF($M$5=\"Course 1\",Général!C$114,IF($M$5=\"Course 2\",Général!C$116,IF($M$5=\"Course 3\",Général!#REF!,Général!C$118)))","v":"Equipage 2"},{"$f":"IF($N$5=\"Course 1\",Général!C$122,IF($N$5=\"Course 2\",Général!C$124,IF($N$5=\"Course 3\",Général!#REF!,Général!C$126)))","v":"Equipage 6"},{"$f":"IF($O$5=\"Course 1\",Général!C$130,IF($O$5=\"Course 2\",Général!C$132,IF($O$5=\"Course 3\",Général!#REF!,Général!C$134)))","v":"Equipage 7"},{"$f":"IF($P$5=\"Course 1\",Général!C$138,IF($P$5=\"Course 2\",Général!C$140,IF($P$5=\"Course 3\",Général!#REF!,Général!C$142)))","v":"Equipage 2"},{"$f":"IF($Q$5=\"Course 1\",Général!C$146,IF($Q$5=\"Course 2\",Général!C$148,IF($Q$5=\"Course 3\",Général!#REF!,Général!C$150)))","v":"Equipage 7"},{"$f":"IF($R$5=\"Course 1\",Général!C$154,IF($R$5=\"Course 2\",Général!C$156,IF($R$5=\"Course 3\",Général!C$158,Général!C$160)))","v":"Equipage 7"},null,null,null,{"$f":"Général!B11","v":"Equipage 9"},11]
["3ème Equipage",null,{"$f":"IF($C$5=\"Course 1\",Général!D34,IF($C$5=\"Course 2\",Général!D36,IF($C$5=\"Course 3\",Général!#REF!,Général!D38)))","v":"Equipage 4"},{"$f":"IF($D$5=\"Course 1\",Général!D42,IF($D$5=\"Course 2\",Général!D44,IF($D$5=\"Course 3\",Général!#REF!,Général!D46)))","v":"Equipage 9"},{"$f":"IF($E$5=\"Course 1\",Général!D50,IF($E$5=\"Course 2\",Général!D52,IF($E$5=\"Course 3\",Général!#REF!,Général!D54)))","v":"Equipage 3"},{"$f":"IF($F$5=\"Course 1\",Général!D$58,IF($F$5=\"Course 2\",Général!D$60,IF($F$5=\"Course 3\",Général!#REF!,Général!D$62)))","v":"Equipage 3"},{"$f":"IF($G$5=\"Course 1\",Général!D$66,IF($G$5=\"Course 2\",Général!D$68,IF($G$5=\"Course 3\",Général!#REF!,Général!D$70)))","v":"Equipage 6"},{"$f":"IF($H$5=\"Course 1\",Général!D$74,IF($H$5=\"Course 2\",Général!D$76,IF($H$5=\"Course 3\",Général!#REF!,Général!D$78)))","v":"Equipage 2"},{"$f":"IF($I$5=\"Course 1\",Général!D$82,IF($I$5=\"Course 2\",Général!D$84,IF($I$5=\"Course 3\",Général!#REF!,Général!D$86)))","v":"Equipage 1"},{"$f":"IF($J$5=\"Course 1\",Général!D$90,IF($J$5=\"Course 2\",Général!D$92,IF($J$5=\"Course 3\",Général!#REF!,Général!D$94)))","v":"Equipage 5"},{"$f":"IF($K$5=\"Course 1\",Général!D$98,IF($K$5=\"Course 2\",Général!D$100,IF($K$5=\"Course 3\",Général!#REF!,Général!D$102)))","v":"Equipage 9"},{"$f":"IF($L$5=\"Course 1\",Général!D$106,IF($L$5=\"Course 2\",Général!D$108,IF($L$5=\"Course 3\",Général!#REF!,Général!D$110)))","v":"Equipage 5"},{"$f":"IF($M$5=\"Course 1\",Général!D$114,IF($M$5=\"Course 2\",Général!D$116,IF($M$5=\"Course 3\",Général!#REF!,Général!D$118)))","v":"Equipage 6"},{"$f":"IF($N$5=\"Course 1\",Général!D$122,IF($N$5=\"Course 2\",Général!D$124,IF($N$5=\"Course 3\",Général!#REF!,Général!D$126)))","v":"Equipage 10"},{"$f":"IF($O$5=\"Course 1\",Général!D$130,IF($O$5=\"Course 2\",Général!D$132,IF($O$5=\"Course 3\",Général!#REF!,Général!D$134)))","v":"Equipage 6"},{"$f":"IF($P$5=\"Course 1\",Général!D$138,IF($P$5=\"Course 2\",Général!D$140,IF($P$5=\"Course 3\",Général!#REF!,Général!D$142)))","v":"Equipage 6"},{"$f":"IF($Q$5=\"Course 1\",Général!D$146,IF($Q$5=\"Course 2\",Général!D$148,IF($Q$5=\"Course 3\",Général!#REF!,Général!D$150)))","v":"Equipage 10"},{"$f":"IF($R$5=\"Course 1\",Général!D$154,IF($R$5=\"Course 2\",Général!D$156,IF($R$5=\"Course 3\",Général!D$158,Général!D$160)))","v":"Equipage 10"},null,null,null,{"$f":"Général!B12","v":"Equipage 10"},7]
["4ème Equipage",null,{"$f":"IF($C$5=\"Course 1\",Général!E34,IF($C$5=\"Course 2\",Général!E36,IF($C$5=\"Course 3\",Général!#REF!,Général!E38)))","v":"Equipage 6"},{"$f":"IF($D$5=\"Course 1\",Général!E42,IF($D$5=\"Course 2\",Général!E44,IF($D$5=\"Course 3\",Général!#REF!,Général!E46)))","v":"Equipage 10"},{"$f":"IF($E$5=\"Course 1\",Général!E50,IF($E$5=\"Course 2\",Général!E52,IF($E$5=\"Course 3\",Général!#REF!,Général!E54)))","v":"Equipage 9"},{"$f":"IF($F$5=\"Course 1\",Général!E$58,IF($F$5=\"Course 2\",Général!E$60,IF($F$5=\"Course 3\",Général!#REF!,Général!E$62)))","v":"Equipage 9"},{"$f":"IF($G$5=\"Course 1\",Général!E$66,IF($G$5=\"Course 2\",Général!E$68,IF($G$5=\"Course 3\",Général!#REF!,Général!E$70)))","v":"Equipage 9"},{"$f":"IF($H$5=\"Course 1\",Général!E$74,IF($H$5=\"Course 2\",Général!E$76,IF($H$5=\"Course 3\",Général!#REF!,Général!E$78)))","v":"Equipage 6"},{"$f":"IF($I$5=\"Course 1\",Général!E$82,IF($I$5=\"Course 2\",Général!E$84,IF($I$5=\"Course 3\",Général!#REF!,Général!E$86)))","v":"Equipage 3"},{"$f":"IF($J$5=\"Course 1\",Général!E$90,IF($J$5=\"Course 2\",Général!E$92,IF($J$5=\"Course 3\",Général!#REF!,Général!E$94)))","v":"Equipage 4"},{"$f":"IF($K$5=\"Course 1\",Général!E$98,IF($K$5=\"Course 2\",Général!E$100,IF($K$5=\"Course 3\",Général!#REF!,Général!E$102)))","v":"Equipage 2"},{"$f":"IF($L$5=\"Course 1\",Général!E$106,IF($L$5=\"Course 2\",Général!E$108,IF($L$5=\"Course 3\",Général!#REF!,Général!E$110)))","v":"Equipage 7"},{"$f":"IF($M$5=\"Course 1\",Général!E$114,IF($M$5=\"Course 2\",Général!E$116,IF($M$5=\"Course 3\",Général!#REF!,Général!E$118)))","v":"Equipage 8"},{"$f":"IF($N$5=\"Course 1\",Général!E$122,IF($N$5=\"Course 2\",Général!E$124,IF($N$5=\"Course 3\",Général!#REF!,Général!E$126)))","v":"Equipage 2"},{"$f":"IF($O$5=\"Course 1\",Général!E$130,IF($O$5=\"Course 2\",Général!E$132,IF($O$5=\"Course 3\",Général!#REF!,Général!E$134)))","v":"Equipage 5"},{"$f":"IF($P$5=\"Course 1\",Général!E$138,IF($P$5=\"Course 2\",Général!E$140,IF($P$5=\"Course 3\",Général!#REF!,Général!E$142)))","v":"Equipage 5"},{"$f":"IF($Q$5=\"Course 1\",Général!E$146,IF($Q$5=\"Course 2\",Général!E$148,IF($Q$5=\"Course 3\",Général!#REF!,Général!E$150)))","v":"Equipage 6"},{"$f":"IF($R$5=\"Course 1\",Général!E$154,IF($R$5=\"Course 2\",Général!E$156,IF($R$5=\"Course 3\",Général!E$158,Général!E$160)))","v":"Equipage 6"}]
["5ème Equipage",null,{"$f":"IF($C$5=\"Course 1\",Général!F34,IF($C$5=\"Course 2\",Général!F36,IF($C$5=\"Course 3\",Général!#REF!,Général!F38)))","v":"Equipage 1"},{"$f":"IF($D$5=\"Course 1\",Général!F42,IF($D$5=\"Course 2\",Général!F44,IF($D$5=\"Course 3\",Général!#REF!,Général!F46)))","v":"Equipage 6"},{"$f":"IF($E$5=\"Course 1\",Général!F50,IF($E$5=\"Course 2\",Général!F52,IF($E$5=\"Course 3\",Général!#REF!,Général!F54)))","v":"Equipage 6"},{"$f":"IF($F$5=\"Course 1\",Général!F$58,IF($F$5=\"Course 2\",Général!F$60,IF($F$5=\"Course 3\",Général!#REF!,Général!F$62)))","v":"Equipage 6"},{"$f":"IF($G$5=\"Course 1\",Général!F$66,IF($G$5=\"Course 2\",Général!F$68,IF($G$5=\"Course 3\",Général!#REF!,Général!F$70)))","v":"Equipage 7"},{"$f":"IF($H$5=\"Course 1\",Général!F$74,IF($H$5=\"Course 2\",Général!F$76,IF($H$5=\"Course 3\",Général!#REF!,Général!F$78)))","v":"Equipage 1"},{"$f":"IF($I$5=\"Course 1\",Général!F$82,IF($I$5=\"Course 2\",Général!F$84,IF($I$5=\"Course 3\",Général!#REF!,Général!F$86)))","v":"Equipage 2"},{"$f":"IF($J$5=\"Course 1\",Général!F$90,IF($J$5=\"Course 2\",Général!F$92,IF($J$5=\"Course 3\",Général!#REF!,Général!F$94)))","v":"Equipage 7"},{"$f":"IF($K$5=\"Course 1\",Général!F$98,IF($K$5=\"Course 2\",Général!F$100,IF($K$5=\"Course 3\",Général!#REF!,Général!F$102)))","v":"Equipage 4"},{"$f":"IF($L$5=\"Course 1\",Général!F$106,IF($L$5=\"Course 2\",Général!$F108,IF($L$5=\"Course 3\",Général!#REF!,Général!F$110)))","v":"Equipage 2"},{"$f":"IF($M$5=\"Course 1\",Général!F$114,IF($M$5=\"Course 2\",Général!F$116,IF($M$5=\"Course 3\",Général!#REF!,Général!F$118)))","v":"Equipage 9"},{"$f":"IF($N$5=\"Course 1\",Général!F$122,IF($N$5=\"Course 2\",Général!F$124,IF($N$5=\"Course 3\",Général!#REF!,Général!F$126)))","v":"Equipage 3"},{"$f":"IF($O$5=\"Course 1\",Général!F$130,IF($O$5=\"Course 2\",Général!F$132,IF($O$5=\"Course 3\",Général!#REF!,Général!F$134)))","v":"Equipage 10"},{"$f":"IF($P$5=\"Course 1\",Général!F$138,IF($P$5=\"Course 2\",Général!F$140,IF($P$5=\"Course 3\",Général!#REF!,Général!F$142)))","v":"Equipage 8"},{"$f":"IF($Q$5=\"Course 1\",Général!F$146,IF($Q$5=\"Course 2\",Général!F$148,IF($Q$5=\"Course 3\",Général!#REF!,Général!F$150)))","v":"Equipage 3"},{"$f":"IF($R$5=\"Course 1\",Général!F$154,IF($R$5=\"Course 2\",Général!F$156,IF($R$5=\"Course 3\",Général!F$158,Général!F$160)))","v":"Equipage 4"}]
["7ème Equipage",null,{"$f":"IF($C$5=\"Course 1\",Général!H34,IF($C$5=\"Course 2\",Général!H36,IF($C$5=\"Course 3\",Général!#REF!,Général!H38)))","v":0},{"$f":"IF($D$5=\"Course 1\",Général!H42,IF($D$5=\"Course 2\",Général!H44,IF($D$5=\"Course 3\",Général!#REF!,Général!H46)))","v":0},{"$f":"IF($E$5=\"Course 1\",Général!H50,IF($E$5=\"Course 2\",Général!H52,IF($E$5=\"Course 3\",Général!#REF!,Général!H54)))","v":0},{"$f":"IF($F$5=\"Course 1\",Général!H$58,IF($F$5=\"Course 2\",Général!H$60,IF($F$5=\"Course 3\",Général!#REF!,Général!H$62)))","v":0},{"$f":"IF($G$5=\"Course 1\",Général!H$66,IF($G$5=\"Course 2\",Général!H$68,IF($G$5=\"Course 3\",Général!#REF!,Général!H$70)))","v":0},{"$f":"IF($H$5=\"Course 1\",Général!H$74,IF($H$5=\"Course 2\",Général!H$76,IF($H$5=\"Course 3\",Général!#REF!,Général!H$78)))","v":0},{"$f":"IF($I$5=\"Course 1\",Général!H$82,IF($I$5=\"Course 2\",Général!H$84,IF($I$5=\"Course 3\",Général!#REF!,Général!H$86)))","v":0},{"$f":"IF($J$5=\"Course 1\",Général!H$90,IF($J$5=\"Course 2\",Général!H$92,IF($J$5=\"Course 3\",Général!#REF!,Général!H$94)))","v":0},{"$f":"IF($K$5=\"Course 1\",Général!H$98,IF($K$5=\"Course 2\",Général!H$100,IF($K$5=\"Course 3\",Général!#REF!,Général!H$102)))","v":0},{"$f":"IF($L$5=\"Course 1\",Général!H$106,IF($L$5=\"Course 2\",Général!H$108,IF($L$5=\"Course 3\",Général!#REF!,Général!H$110)))","v":0},{"$f":"IF($M$5=\"Course 1\",Général!H$114,IF($M$5=\"Course 2\",Général!H$116,IF($M$5=\"Course 3\",Général!#REF!,Général!H$118)))","v":0},{"$f":"IF($N$5=\"Course 1\",Général!H$122,IF($N$5=\"Course 2\",Général!H$124,IF($N$5=\"Course 3\",Général!#REF!,Général!H$126)))","v":0},{"$f":"IF($O$5=\"Course 1\",Général!H$130,IF($O$5=\"Course 2\",Général!H$132,IF($O$5=\"Course 3\",Général!#REF!,Général!H$134)))","v":0},{"$f":"IF($P$5=\"Course 1\",Général!H$138,IF($P$5=\"Course 2\",Général!H$140,IF($P$5=\"Course 3\",Général!#REF!,Général!H$142)))","v":0},{"$f":"IF($Q$5=\"Course 1\",Général!H$146,IF($Q$5=\"Course 2\",Général!H$148,IF($Q$5=\"Course 3\",Général!#REF!,Général!H$150)))","v":0},{"$f":"IF($R$5=\"Course 1\",Général!H$154,IF($R$5=\"Course 2\",Général!H$156,IF($R$5=\"Course 3\",Général!H$158,Général!H$160)))","v":0},null,null,null,{"$f":"Général!B14","v":"Equipage 14"},{"$f":"COUNTIF($C$8:$R$16,V13)","v":0}]
["8ème Equipage",null,{"$f":"IF($C$5=\"Course 1\",Général!I34,IF($C$5=\"Course 2\",Général!I36,IF($C$5=\"Course 3\",Général!#REF!,Général!I38)))","v":0},{"$f":"IF($D$5=\"Course 1\",Général!I42,IF($D$5=\"Course 2\",Général!I44,IF($D$5=\"Course 3\",Général!#REF!,Général!I46)))","v":0},{"$f":"IF($E$5=\"Course 1\",Général!I50,IF($E$5=\"Course 2\",Général!I52,IF($E$5=\"Course 3\",Général!#REF!,Général!I54)))","v":0},{"$f":"IF($F$5=\"Course 1\",Général!I$58,IF($F$5=\"Course 2\",Général!I$60,IF($F$5=\"Course 3\",Général!#REF!,Général!I$62)))","v":0},{"$f":"IF($G$5=\"Course 1\",Général!I$66,IF($G$5=\"Course 2\",Général!I$68,IF($G$5=\"Course 3\",Général!#REF!,Général!I$70)))","v":0},{"$f":"IF($H$5=\"Course 1\",Général!I$74,IF($H$5=\"Course 2\",Général!I$76,IF($H$5=\"Course 3\",Général!#REF!,Général!I$78)))","v":0},{"$f":"IF($I$5=\"Course 1\",Général!I$82,IF($I$5=\"Course 2\",Général!I$84,IF($I$5=\"Course 3\",Général!#REF!,Général!I$86)))","v":0},{"$f":"IF($J$5=\"Course 1\",Général!I$90,IF($J$5=\"Course 2\",Général!I$92,IF($J$5=\"Course 3\",Général!#REF!,Général!I$94)))","v":0},{"$f":"IF($K$5=\"Course 1\",Général!I$98,IF($K$5=\"Course 2\",Général!I$100,IF($K$5=\"Course 3\",Général!#REF!,Général!I$102)))","v":0},{"$f":"IF($L$5=\"Course 1\",Général!I$106,IF($L$5=\"Course 2\",Général!I$108,IF($L$5=\"Course 3\",Général!#REF!,Général!I$110)))","v":0},{"$f":"IF($M$5=\"Course 1\",Général!I$114,IF($M$5=\"Course 2\",Général!I$116,IF($M$5=\"Course 3\",Général!#REF!,Général!I$118)))","v":0},{"$f":"IF($N$5=\"Course 1\",Général!I$122,IF($N$5=\"Course 2\",Général!I$124,IF($N$5=\"Course 3\",Général!#REF!,Général!I$126)))","v":0},{"$f":"IF($O$5=\"Course 1\",Général!I$130,IF($O$5=\"Course 2\",Général!I$132,IF($O$5=\"Course 3\",Général!#REF!,Général!I$134)))","v":0},{"$f":"IF($P$5=\"Course 1\",Général!I$138,IF($P$5=\"Course 2\",Général!I$140,IF($P$5=\"Course 3\",Général!#REF!,Général!I$142)))","v":0},{"$f":"IF($Q$5=\"Course 1\",Général!I$146,IF($Q$5=\"Course 2\",Général!I$148,IF($Q$5=\"Course 3\",Général!#REF!,Général!I$150)))","v":0},{"$f":"IF($R$5=\"Course 1\",Général!I$154,IF($R$5=\"Course 2\",Général!I$156,IF($R$5=\"Course 3\",Général!I$158,Général!I$160)))","v":0},null,null,null,{"$f":"Général!B15","v":"Equipage 15"},0]
["9ème Equipage",null,{"$f":"IF($C$5=\"Course 1\",Général!J34,IF($C$5=\"Course 2\",Général!J36,IF($C$5=\"Course 3\",Général!#REF!,Général!J38)))","v":0},{"$f":"IF($D$5=\"Course 1\",Général!J42,IF($D$5=\"Course 2\",Général!J44,IF($D$5=\"Course 3\",Général!#REF!,Général!J46)))","v":0},{"$f":"IF($E$5=\"Course 1\",Général!J50,IF($E$5=\"Course 2\",Général!J52,IF($E$5=\"Course 3\",Général!#REF!,Général!J54)))","v":0},{"$f":"IF($F$5=\"Course 1\",Général!J$58,IF($F$5=\"Course 2\",Général!J$60,IF($F$5=\"Course 3\",Général!#REF!,Général!J$62)))","v":0},{"$f":"IF($G$5=\"Course 1\",Général!J$66,IF($G$5=\"Course 2\",Général!J$68,IF($G$5=\"Course 3\",Général!#REF!,Général!J$70)))","v":0},{"$f":"IF($H$5=\"Course 1\",Général!J$74,IF($H$5=\"Course 2\",Général!J$76,IF($H$5=\"Course 3\",Général!#REF!,Général!J$78)))","v":0},{"$f":"IF($I$5=\"Course 1\",Général!J$82,IF($I$5=\"Course 2\",Général!J$84,IF($I$5=\"Course 3\",Général!#REF!,Général!J$86)))","v":0},{"$f":"IF($J$5=\"Course 1\",Général!J$90,IF($J$5=\"Course 2\",Général!J$92,IF($J$5=\"Course 3\",Général!#REF!,Général!J$94)))","v":0},{"$f":"IF($K$5=\"Course 1\",Général!J$98,IF($K$5=\"Course 2\",Général!J$100,IF($K$5=\"Course 3\",Général!#REF!,Général!J$102)))","v":0},{"$f":"IF($L$5=\"Course 1\",Général!J$106,IF($L$5=\"Course 2\",Général!J$108,IF($L$5=\"Course 3\",Général!#REF!,Général!J$110)))","v":0},{"$f":"IF($M$5=\"Course 1\",Général!J$114,IF($M$5=\"Course 2\",Général!J$116,IF($M$5=\"Course 3\",Général!#REF!,Général!J$118)))","v":0},{"$f":"IF($N$5=\"Course 1\",Général!J$122,IF($N$5=\"Course 2\",Général!J$124,IF($N$5=\"Course 3\",Général!#REF!,Général!J$126)))","v":0},{"$f":"IF($O$5=\"Course 1\",Général!J$130,IF($O$5=\"Course 2\",Général!J$132,IF($O$5=\"Course 3\",Général!#REF!,Général!J$134)))","v":0},{"$f":"IF($P$5=\"Course 1\",Général!J$138,IF($P$5=\"Course 2\",Général!J$140,IF($P$5=\"Course 3\",Général!#REF!,Général!J$142)))","v":0},{"$f":"IF($Q$5=\"Course 1\",Général!J$146,IF($Q$5=\"Course 2\",Général!J$148,IF($Q$5=\"Course 3\",Général!#REF!,Général!J$150)))","v":0},{"$f":"IF($R$5=\"Course 1\",Général!J$154,IF($R$5=\"Course 2\",Général!J$156,IF($R$5=\"Course 3\",Général!J$158,Général!J$160)))","v":0},null,null,null,{"$f":"Général!B16","v":"Equipage 16"},0]
["10ème Equipage",null,{"$f":"IF($C$5=\"Course 1\",Général!K34,IF($C$5=\"Course 2\",Général!K36,IF($C$5=\"Course 3\",Général!#REF!,Général!K38)))","v":0},{"$f":"IF($D$5=\"Course 1\",Général!K42,IF($D$5=\"Course 2\",Général!K44,IF($D$5=\"Course 3\",Général!#REF!,Général!K46)))","v":0},{"$f":"IF($E$5=\"Course 1\",Général!K50,IF($E$5=\"Course 2\",Général!K52,IF($E$5=\"Course 3\",Général!#REF!,Général!K54)))","v":0},{"$f":"IF($F$5=\"Course 1\",Général!K$58,IF($F$5=\"Course 2\",Général!K$60,IF($F$5=\"Course 3\",Général!#REF!,Général!K$62)))","v":0},{"$f":"IF($G$5=\"Course 1\",Général!K$66,IF($G$5=\"Course 2\",Général!K$68,IF($G$5=\"Course 3\",Général!#REF!,Général!K$70)))","v":0},{"$f":"IF($H$5=\"Course 1\",Général!K$74,IF($H$5=\"Course 2\",Général!K$76,IF($H$5=\"Course 3\",Général!#REF!,Général!K$78)))","v":0},{"$f":"IF($I$5=\"Course 1\",Général!K$82,IF($I$5=\"Course 2\",Général!K$84,IF($I$5=\"Course 3\",Général!#REF!,Général!K$86)))","v":0},{"$f":"IF($J$5=\"Course 1\",Général!K$90,IF($J$5=\"Course 2\",Général!K$92,IF($J$5=\"Course 3\",Général!#REF!,Général!K$94)))","v":0},{"$f":"IF($K$5=\"Course 1\",Général!K$98,IF($K$5=\"Course 2\",Général!K$100,IF($K$5=\"Course 3\",Général!#REF!,Général!K$102)))","v":0},{"$f":"IF($L$5=\"Course 1\",Général!K$106,IF($L$5=\"Course 2\",Général!K$108,IF($L$5=\"Course 3\",Général!#REF!,Général!K$110)))","v":0},{"$f":"IF($M$5=\"Course 1\",Général!K$114,IF($M$5=\"Course 2\",Général!K$116,IF($M$5=\"Course 3\",Général!#REF!,Général!K$118)))","v":0},{"$f":"IF($N$5=\"Course 1\",Général!K$122,IF($N$5=\"Course 2\",Général!K$124,IF($N$5=\"Course 3\",Général!#REF!,Général!K$126)))","v":0},{"$f":"IF($O$5=\"Course 1\",Général!K$130,IF($O$5=\"Course 2\",Général!K$132,IF($O$5=\"Course 3\",Général!#REF!,Général!K$134)))","v":0},{"$f":"IF($P$5=\"Course 1\",Général!K$138,IF($P$5=\"Course 2\",Général!K$140,IF($P$5=\"Course 3\",Général!#REF!,Général!K$142)))","v":0},{"$f":"IF($Q$5=\"Course 1\",Général!K$146,IF($Q$5=\"Course 2\",Général!K$148,IF($Q$5=\"Course 3\",Général!#REF!,Général!K$150)))","v":0},{"$f":"IF($R$5=\"Course 1\",Général!K$154,IF($R$5=\"Course 2\",Général!K$156,IF($R$5=\"Course 3\",Général!K$158,Général!K$160)))","v":0},null,null,null,{"$f":"Général!B17","v":"Equipage 17"},0]
[null,null,null,null,null,null,null,null,null,null,null,null,null,null,null,null,null,null,null,null,null,{"$f":"Général!B18","v":"Equipage 18"},0]
[null,null,null,null,null,null,null,null,null,null,null,null,null,null,null,null,null,null,null,null,null,{"$f":"Général!B19","v":"Equipage 19"},0]
[null,null,null,null,null,null,null,null,null,null,null,null,null,null,null,null,null,null,null,null,null,{"$f":"Général!B20","v":"Equipage 20"},0]
[null,null,null,null,null,null,null,null,null,null,null,null,null,null,null,null,null,null,null,null,null,{"$f":"Général!B21","v":"Equipage 21"},0]
[null,null,null,null,null,null,null,null,null,null,null,null,null,null,null,null,null,null,null,null,null,{"$f":"Général!B22","v":"Equipage 22"},0]
[null,null,null,null,null,null,null,null,null,null,null,null,null,null,null,null,null,null,null,null,null,{"$f":"Général!B23","v":"Equipage 23"},0]
[null,null,null,null,null,null,null,null,null,null,null,null,null,null,null,null,null,null,null,null,null,{"$f":"Général!B24","v":"Equipage 24"},0]
[null,null,null,null,null,null,null,null,null,null,null,null,null,null,null,null,null,null,null,null,null,{"$f":"Général!B25","v":"Equipage 25"},0]
[null,null,null,null,null,null,null,null,null,null,null,null,null,null,null,null,null,null,null,null,null,{"$f":"Général!B26","v":"Equipage 26"},0]
[null,null,null,null,null,null,null,null,null,null,null,null,null,null,null,null,null,null,null,null,null,{"$f":"Général!B27","v":"Equipage 27"},0]
[null,null,null,null,null,null,null,null,null,null,null,null,null,null,null,null,null,null,null,null,null,{"$f":"Général!B28","v":"Equipage 28"},0]
[null,null,null,null,null,null,null,null,null,null,null,null,null,null,null,null,null,null,null,null,null,{"$f":"Général!B29","v":"Equipage 29"},0]
[null,null,null,null,null,null,null,null,null,null,null,null,null,null,null,null,null,null,null,null,null,{"$f":"Général!B30","v":"Equipage 30"},0]

{"sheet":"Eq.7","index":12,"n_rows":29,"n_cols":23,"rows_kept":29,"cut":false,"hidden":true,"merged":[[7,0,7,1],[0,0,1,5],[0,6,1,10],[3,0,3,1],[4,0,4,1],[5,0,5,1],[14,0,14,1],[15,0,15,1],[8,0,8,1],[9,0,9,1],[10,0,10,1],[11,0,11,1],[12,0,12,1],[13,0,13,1]]}
["Equipage ",null,null,null,null,null,{"$f":"Général!B9","v":"Equipage 7"},null,null,null,null,null,null,null,null,null,null,null,null,null,null,{"$f":"Général!B3","v":"Equipage 1"},{"$f":"COUNTIF(C$8:R$16,V1)","v":7}]
[null,null,null,null,null,null,null,null,null,null,null,null,null,null,null,null,null,null,null,null,null,{"$f":"Général!B4","v":"Equipage 2"},{"$f":"COUNTIF($C$8:$R$16,V2)","v":4}]
[null,null,null,null,null,null,null,null,null,null,null,null,null,null,null,null,null,null,null,null,null,{"$f":"Général!B5","v":"Equipage 3"},9]
[null,null,"FLIGHT 1","FLIGHT 2","FLIGHT 3","FLIGHT 4","FLIGHT 5","FLIGHT 6","FLIGHT 7","FLIGHT 8","FLIGHT 9","FLIGHT 10","FLIGHT 11","FLIGHT 12","FLIGHT 13","FLIGHT 14","FLIGHT 15","FLIGHT 16","FLIGHT 17","FLIGHT 18",null,{"$f":"Général!B6","v":"Equipage 4"},9]
["N° de course",null,{"$f":"IF(COUNTIF(Général!B34:K34,$G$1)=1,\"Course 1\",IF(COUNTIF(Général!B36:K36,$G$1)=1,\"Course 2\",IF(COUNTIF(Général!#REF!,$G$1)=1,\"Course 3\",\"Course 4\")))","v":"Course 1"},{"$f":"IF(COUNTIF(Général!B42:K42,$G$1)=1,\"Course 1\",IF(COUNTIF(Général!B44:K44,$G$1)=1,\"Course 2\",IF(COUNTIF(Général!#REF!,$G$1)=1,\"Course 3\",\"Course 4\")))","v":"Course 2"},{"$f":"IF(COUNTIF(Général!B50:K50,$G$1)=1,\"Course 1\",IF(COUNTIF(Général!B52:K52,$G$1)=1,\"Course 2\",IF(COUNTIF(Général!#REF!,$G$1)=1,\"Course 3\",\"Course 4\")))","v":"Course 1"},{"$f":"IF(COUNTIF(Général!B58:K58,$G$1)=1,\"Course 1\",IF(COUNTIF(Général!B60:K60,$G$1)=1,\"Course 2\",IF(COUNTIF(Général!#REF!,$G$1)=1,\"Course 3\",\"Course 4\")))","v":"Course 1"},{"$f":"IF(COUNTIF(Général!B66:K66,$G$1)=1,\"Course 1\",IF(COUNTIF(Général!B68:K68,$G$1)=1,\"Course 2\",IF(COUNTIF(Général!#REF!,$G$1)=1,\"Course 3\",\"Course 4\")))","v":"Course 1"},{"$f":"IF(COUNTIF(Général!B74:K74,$G$1)=1,\"Course 1\",IF(COUNTIF(Général!B76:K76,$G$1)=1,\"Course 2\",IF(COUNTIF(Général!#REF!,$G$1)=1,\"Course 3\",\"Course 4\")))","v":"Course 1"},{"$f":"IF(COUNTIF(Général!B82:K82,$G$1)=1,\"Course 1\",IF(COUNTIF(Général!B84:K84,$G$1)=1,\"Course 2\",IF(COUNTIF(Général!#REF!,$G$1)=1,\"Course 3\",\"Course 4\")))","v":"Course 1"},{"$f":"IF(COUNTIF(Général!B90:K90,$G$1)=1,\"Course 1\",IF(COUNTIF(Général!B92:K92,$G$1)=1,\"Course 2\",IF(COUNTIF(Général!#REF!,$G$1)=1,\"Course 3\",\"Course 4\")))","v":"Course 1"},{"$f":"IF(COUNTIF(Général!B98:K98,$G$1)=1,\"Course 1\",IF(COUNTIF(Général!B100:K100,$G$1)=1,\"Course 2\",IF(COUNTIF(Général!#REF!,$G$1)=1,\"Course 3\",\"Course 4\")))","v":"Course 2"},{"$f":"IF(COUNTIF(Général!B106:K106,$G$1)=1,\"Course 1\",IF(COUNTIF(Général!B108:K108,$G$1)=1,\"Course 2\",IF(COUNTIF(Général!#REF!,$G$1)=1,\"Course 3\",\"Course 4\")))","v":"Course 1"},{"$f":"IF(COUNTIF(Général!B114:K114,$G$1)=1,\"Course 1\",IF(COUNTIF(Général!B116:K116,$G$1)=1,\"Course 2\",IF(COUNTIF(Général!#REF!,$G$1)=1,\"Course 3\",\"Course 4\")))","v":"Course 2"},{"$f":"IF(COUNTIF(Général!B122:K122,$G$1)=1,\"Course 1\",IF(COUNTIF(Général!B124:K124,$G$1)=1,\"Course 2\",IF(COUNTIF(Général!#REF!,$G$1)=1,\"Course 3\",\"Course 4\")))","v":"Course 2"},{"$f":"IF(COUNTIF(Général!B130:K130,$G$1)=1,\"Course 1\",IF(COUNTIF(Général!B132:K132,$G$1)=1,\"Course 2\",IF(COUNTIF(Général!#REF!,$G$1)=1,\"Course 3\",\"Course 4\")))","v":"Course 2"},{"$f":"IF(COUNTIF(Général!B138:K138,$G$1)=1,\"Course 1\",IF(COUNTIF(Général!B140:K140,$G$1)=1,\"Course 2\",IF(COUNTIF(Général!#REF!,$G$1)=1,\"Course 3\",\"Course 4\")))","v":"Course 2"},{"$f":"IF(COUNTIF(Général!B146:K146,$G$1)=1,\"Course 1\",IF(COUNTIF(Général!B148:K148,$G$1)=1,\"Course 2\",IF(COUNTIF(Général!#REF!,$G$1)=1,\"Course 3\",\"Course 4\")))","v":"Course 2"},{"$f":"IF(COUNTIF(Général!B154:K154,$G$1)=1,\"Course 1\",IF(COUNTIF(Général!B156:K156,$G$1)=1,\"Course 2\",IF(COUNTIF(Général!B158:K158,$G$1)=1,\"Course 3\",\"Course 4\")))","v":"Course 1"},{"$f":"IF(COUNTIF(Général!C154:L154,$G$1)=1,\"Course 1\",IF(COUNTIF(Général!C156:L156,$G$1)=1,\"Course 2\",IF(COUNTIF(Général!C158:L158,$G$1)=1,\"Course 3\",\"Course 4\")))","v":"Course 1"},{"$f":"IF(COUNTIF(Général!D154:M154,$G$1)=1,\"Course 1\",IF(COUNTIF(Général!D156:M156,$G$1)=1,\"Course 2\",IF(COUNTIF(Général!D158:M158,$G$1)=1,\"Course 3\",\"Course 4\")))","v":"Course 4"},null,{"$f":"Général!B7","v":"Equipage 5"},8]
["Bateau",null,{"$f":"IF(COUNTIF(Général!B34:B38,$G$1)=1,\"Boat 1\",IF(COUNTIF(Général!C34:C38,$G$1)=1,\"Boat 2\",IF(COUNTIF(Général!D34:D38,$G$1)=1,\"Boat 3\",IF(COUNTIF(Général!E34:E38,$G$1)=1,\"Boat 4\",IF(COUNTIF(Général!F34:F38,$G$1)=1,\"Boat 5\",IF(COUNTIF(Général!G34:G38,$G$1)=1,\"Boat 6\",IF(COUNTIF(Général!H34:H38,$G$1)=1,\"Boat 7\",IF(COUNTIF(Général!I34:I38,$G$1)=1,\"Boat 8\",IF(COUNTIF(Général!J34:J38,$G$1)=1,\"Boat 9\",\"Boat10\")))))))))","v":"Boat 1"},{"$f":"IF(COUNTIF(Général!B42:B46,$G$1)=1,\"Boat 1\",IF(COUNTIF(Général!C42:C46,$G$1)=1,\"Boat 2\",IF(COUNTIF(Général!D42:D46,$G$1)=1,\"Boat 3\",IF(COUNTIF(Général!E42:E46,$G$1)=1,\"Boat 4\",IF(COUNTIF(Général!F42:F46,$G$1)=1,\"Boat 5\",IF(COUNTIF(Général!G42:G46,$G$1)=1,\"Boat 6\",IF(COUNTIF(Général!H42:H46,$G$1)=1,\"Boat 7\",IF(COUNTIF(Général!I42:I46,$G$1)=1,\"Boat 8\",IF(COUNTIF(Général!J42:J46,$G$1)=1,\"Boat 9\",\"Boat 10\")))))))))","v":"Boat 5"},{"$f":"IF(COUNTIF(Général!B50:B54,$G$1)=1,\"Boat 1\",IF(COUNTIF(Général!C50:C54,$G$1)=1,\"Boat 2\",IF(COUNTIF(Général!D50:D54,$G$1)=1,\"Boat 3\", IF(COUNTIF(Général!E50:E54,$G$1)=1,\"Boat 4\", IF(COUNTIF(Général!F50:F54,$G$1)=1,\"Boat 5\", IF(COUNTIF(Général!G50:G54,$G$1)=1,\"Boat 6\", IF(COUNTIF(Général!H50:H54,$G$1)=1,\"Boat 7\",IF(COUNTIF(Général!I50:I54,$G$1)=1,\"Boat 8\",IF(COUNTIF(Général!J50:J54,$G$1)=1,\"Boat 9\",\"Boat 10\")))))))))","v":"Boat 5"},{"$f":"IF(COUNTIF(Général!B58:B62,$G$1)=1,\"Boat 1\",IF(COUNTIF(Général!C58:C62,$G$1)=1,\"Boat 2\",IF(COUNTIF(Général!D58:D62,$G$1)=1,\"Boat 3\", IF(COUNTIF(Général!E58:E62,$G$1)=1,\"Boat 4\", IF(COUNTIF(Général!F58:F62,$G$1)=1,\"Boat 5\", IF(COUNTIF(Général!G58:G62,$G$1)=1,\"Boat 6\", IF(COUNTIF(Général!H58:H62,$G$1)=1,\"Boat 7\",IF(COUNTIF(Général!I58:I62,$G$1)=1,\"Boat 8\",IF(COUNTIF(Général!I58:J62,$G$1)=1,\"Boat 9\",\"Boat 10\")))))))))","v":"Boat 2"},{"$f":"IF(COUNTIF(Général!B66:B70,$G$1)=1,\"Boat 1\",IF(COUNTIF(Général!C66:C70,$G$1)=1,\"Boat 2\",IF(COUNTIF(Général!D66:D70,$G$1)=1,\"Boat 3\", IF(COUNTIF(Général!E66:E70,$G$1)=1,\"Boat 4\", IF(COUNTIF(Général!F66:F70,$G$1)=1,\"Boat 5\", IF(COUNTIF(Général!G66:G70,$G$1)=1,\"Boat 6\", IF(COUNTIF(Général!H66:H70,$G$1)=1,\"Boat 7\",IF(COUNTIF(Général!I66:I70,$G$1)=1,\"Boat 8\",IF(COUNTIF(Général!J66:J70,$G$1)=1,\"Boat 9\",\"Boat 10\")))))))))","v":"Boat 5"},{"$f":"IF(COUNTIF(Général!B74:B78,$G$1)=1,\"Boat 1\",IF(COUNTIF(Général!C74:C78,$G$1)=1,\"Boat 2\",IF(COUNTIF(Général!D74:D78,$G$1)=1,\"Boat 3\", IF(COUNTIF(Général!E74:E78,$G$1)=1,\"Boat 4\", IF(COUNTIF(Général!F74:F78,$G$1)=1,\"Boat 5\", IF(COUNTIF(Général!G74:G78,$G$1)=1,\"Boat 6\", IF(COUNTIF(Général!H74:H78,$G$1)=1,\"Boat 7\",IF(COUNTIF(Général!I74:I78,$G$1)=1,\"Boat 8\",IF(COUNTIF(Général!J74:J78,$G$1)=1,\"Boat 9\",\"Boat 10\")))))))))","v":"Boat 2"},{"$f":"IF(COUNTIF(Général!B82:B86,$G$1)=1,\"Boat 1\",IF(COUNTIF(Général!C82:C86,$G$1)=1,\"Boat 2\",IF(COUNTIF(Général!D82:D86,$G$1)=1,\"Boat 3\", IF(COUNTIF(Général!E82:E86,$G$1)=1,\"Boat 4\", IF(COUNTIF(Général!F82:F86,$G$1)=1,\"Boat 5\", IF(COUNTIF(Général!G82:G86,$G$1)=1,\"Boat 6\", IF(COUNTIF(Général!H82:H86,$G$1)=1,\"Boat 7\",IF(COUNTIF(Général!I82:I86,$G$1)=1,\"Boat 8\",IF(COUNTIF(Général!J82:J86,$G$1)=1,\"Boat 9\",\"Boat 10\")))))))))","v":"Boat 3"},{"$f":"IF(COUNTIF(Général!B90:B94,$G$1)=1,\"Boat 1\",IF(COUNTIF(Général!C90:C94,$G$1)=1,\"Boat 2\",IF(COUNTIF(Général!D90:D94,$G$1)=1,\"Boat 3\", IF(COUNTIF(Général!E90:E94,$G$1)=1,\"Boat 4\", IF(COUNTIF(Général!F90:F94,$G$1)=1,\"Boat 5\", IF(COUNTIF(Général!G90:G94,$G$1)=1,\"Boat 6\", IF(COUNTIF(Général!H90:H94,$G$1)=1,\"Boat 7\",IF(COUNTIF(Général!I90:I94,$G$1)=1,\"Boat 8\",IF(COUNTIF(Général!J90:J94,$G$1)=1,\"Boat 9\",\"Boat 10\")))))))))","v":"Boat 5"},{"$f":"IF(COUNTIF(Général!B98:B102,$G$1)=1,\"Boat 1\",IF(COUNTIF(Général!C98:C102,$G$1)=1,\"Boat 2\",IF(COUNTIF(Général!D98:D102,$G$1)=1,\"Boat 3\", IF(COUNTIF(Général!E98:E102,$G$1)=1,\"Boat 4\", IF(COUNTIF(Général!F98:F102,$G$1)=1,\"Boat 5\", IF(COUNTIF(Général!G98:G102,$G$1)=1,\"Boat 6\", IF(COUNTIF(Général!H98:H102,$G$1)=1,\"Boat 7\",IF(COUNTIF(Général!I98:I102,$G$1)=1,\"Boat 8\",IF(COUNTIF(Général!J98:J102,$G$1)=1,\"Boat 9\",\"Boat 10\")))))))))","v":"Boat 4"},{"$f":"IF(COUNTIF(Général!B106:B110,$G$1)=1,\"Boat 1\",IF(COUNTIF(Général!C106:C110,$G$1)=1,\"Boat 2\",IF(COUNTIF(Général!D106:D110,$G$1)=1,\"Boat 3\", IF(COUNTIF(Général!E106:E110,$G$1)=1,\"Boat 4\", IF(COUNTIF(Général!F106:F110,$G$1)=1,\"Boat 5\", IF(COUNTIF(Général!G106:G110,$G$1)=1,\"Boat 6\", IF(COUNTIF(Général!H106:H110,$G$1)=1,\"Boat 7\",IF(COUNTIF(Général!I106:I110,$G$1)=1,\"Boat 8\",IF(COUNTIF(Général!J106:J110,$G$1)=1,\"Boat 9\",\"Boat 10\")))))))))","v":"Boat 4"},{"$f":"IF(COUNTIF(Général!B114:B118,$G$1)=1,\"Boat 1\",IF(COUNTIF(Général!C114:C118,$G$1)=1,\"Boat 2\",IF(COUNTIF(Général!C114:D118,$G$1)=1,\"Boat 3\", IF(COUNTIF(Général!C114:E118,$G$1)=1,\"Boat 4\", IF(COUNTIF(Général!F114:F118,$G$1)=1,\"Boat 5\", IF(COUNTIF(Général!G114:G118,$G$1)=1,\"Boat 6\", IF(COUNTIF(Général!H114:H118,$G$1)=1,\"Boat 7\",IF(COUNTIF(Général!I114:I118,$G$1)=1,\"Boat 8\",IF(COUNTIF(Général!J114:J118,$G$1)=1,\"Boat 9\",\"Boat 10\")))))))))","v":"Boat 2"},{"$f":"IF(COUNTIF(Général!B122:B126,$G$1)=1,\"Boat 1\",IF(COUNTIF(Général!C122:C126,$G$1)=1,\"Boat 2\",IF(COUNTIF(Général!D122:D126,$G$1)=1,\"Boat 3\", IF(COUNTIF(Général!E122:E126,$G$1)=1,\"Boat 4\", IF(COUNTIF(Général!F122:F126,$G$1)=1,\"Boat 5\", IF(COUNTIF(Général!G122:G126,$G$1)=1,\"Boat 6\", IF(COUNTIF(Général!H122:H126,$G$1)=1,\"Boat 7\",IF(COUNTIF(Général!I122:I126,$G$1)=1,\"Boat 8\",IF(COUNTIF(Général!J122:J126,$G$1)=1,\"Boat 9\",\"Boat 10\")))))))))","v":"Boat 3"},{"$f":"IF(COUNTIF(Général!B130:B134,$G$1)=1,\"Boat 1\",IF(COUNTIF(Général!C130:C134,$G$1)=1,\"Boat 2\",IF(COUNTIF(Général!D130:D134,$G$1)=1,\"Boat 3\", IF(COUNTIF(Général!E130:E134,$G$1)=1,\"Boat 4\", IF(COUNTIF(Général!F130:F134,$G$1)=1,\"Boat 5\", IF(COUNTIF(Général!G130:G134,$G$1)=1,\"Boat 6\", IF(COUNTIF(Général!H130:H134,$G$1)=1,\"Boat 7\",IF(COUNTIF(Général!I130:I134,$G$1)=1,\"Boat 8\",IF(COUNTIF(Général!J130:J134,$G$1)=1,\"Boat 9\",\"Boat 10\")))))))))","v":"Boat 2"},{"$f":"IF(COUNTIF(Général!B138:B142,$G$1)=1,\"Boat 1\",IF(COUNTIF(Général!C138:C142,$G$1)=1,\"Boat 2\",IF(COUNTIF(Général!D138:D142,$G$1)=1,\"Boat 3\", IF(COUNTIF(Général!E138:E142,$G$1)=1,\"Boat 4\", IF(COUNTIF(Général!F138:F142,$G$1)=1,\"Boat 5\", IF(COUNTIF(Général!G138:G142,$G$1)=1,\"Boat 6\", IF(COUNTIF(Général!H138:H142,$G$1)=1,\"Boat 7\",IF(COUNTIF(Général!I138:I142,$G$1)=1,\"Boat 8\",IF(COUNTIF(Général!J138:J142,$G$1)=1,\"Boat 9\",\"Boat 10\")))))))))","v":"Boat 1"},{"$f":"IF(COUNTIF(Général!B146:B150,$G$1)=1,\"Boat 1\",IF(COUNTIF(Général!C146:C150,$G$1)=1,\"Boat 2\",IF(COUNTIF(Général!D146:D150,$G$1)=1,\"Boat 3\", IF(COUNTIF(Général!E146:E150,$G$1)=1,\"Boat 4\", IF(COUNTIF(Général!F146:F150,$G$1)=1,\"Boat 5\", IF(COUNTIF(Général!G146:G150,$G$1)=1,\"Boat 6\", IF(COUNTIF(Général!H146:H150,$G$1)=1,\"Boat 7\",IF(COUNTIF(Général!I146:I150,$G$1)=1,\"Boat 8\",IF(COUNTIF(Général!J146:J150,$G$1)=1,\"Boat 9\",\"Boat 10\")))))))))","v":"Boat 2"},{"$f":"IF(COUNTIF(Général!B154:B157,$G$1)=1,\"Boat 1\",IF(COUNTIF(Général!C154:C157,$G$1)=1,\"Boat 2\",IF(COUNTIF(Général!D154:D157,$G$1)=1,\"Boat 3\", IF(COUNTIF(Général!E154:E157,$G$1)=1,\"Boat 4\", IF(COUNTIF(Général!F154:F157,$G$1)=1,\"Boat 5\", IF(COUNTIF(Général!G154:G157,$G$1)=1,\"Boat 6\", IF(COUNTIF(Général!H154:H157,$G$1)=1,\"Boat 7\",IF(COUNTIF(Général!I154:I157,$G$1)=1,\"Boat 8\",IF(COUNTIF(Général!J154:J157,$G$1)=1,\"Boat 9\",\"Boat 10\")))))))))","v":"Boat 2"},{"$f":"IF(COUNTIF(Général!B160:B163,$G$1)=1,\"Boat 1\",IF(COUNTIF(Général!C160:C163,$G$1)=1,\"Boat 2\",IF(COUNTIF(Général!D160:D163,$G$1)=1,\"Boat 3\", IF(COUNTIF(Général!E160:E163,$G$1)=1,\"Boat 4\", IF(COUNTIF(Général!F160:F163,$G$1)=1,\"Boat 5\", IF(COUNTIF(Général!G160:G163,$G$1)=1,\"Boat 6\", IF(COUNTIF(Général!H160:H163,$G$1)=1,\"Boat 7\",IF(COUNTIF(Général!I160:I163,$G$1)=1,\"Boat 8\",IF(COUNTIF(Général!J160:J163,$G$1)=1,\"Boat 9\",\"Boat 10\")))))))))","v":"Boat 2"},{"$f":"IF(COUNTIF(Général!B166:B169,$G$1)=1,\"Boat 1\",IF(COUNTIF(Général!C166:C169,$G$1)=1,\"Boat 2\",IF(COUNTIF(Général!D166:D169,$G$1)=1,\"Boat 3\", IF(COUNTIF(Général!E166:E169,$G$1)=1,\"Boat 4\", IF(COUNTIF(Général!F166:F169,$G$1)=1,\"Boat 5\", IF(COUNTIF(Général!G166:G169,$G$1)=1,\"Boat 6\", IF(COUNTIF(Général!H166:H169,$G$1)=1,\"Boat 7\",IF(COUNTIF(Général!I166:I169,$G$1)=1,\"Boat 8\",IF(COUNTIF(Général!J166:J169,$G$1)=1,\"Boat 9\",\"Boat 10\")))))))))","v":"Boat 2"},null,{"$f":"Général!B8","v":"Equipage 6"},9]
[null,null,null,null,null,null,null,null,null,null,null,null,null,null,null,null,null,null,null,null,null,{"$f":"Général!B9","v":"Equipage 7"},16]
["1er Equipage",null,{"$f":"IF($C$5=\"Course 1\",Général!B34,IF($C$5=\"Course 2\",Général!B36,IF($C$5=\"Course 3\",Général!#REF!,Général!B38)))","v":"Equipage 7"},{"$f":"IF($D$5=\"Course 1\",Général!B42,IF($D$5=\"Course 2\",Général!B44,IF($D$5=\"Course 3\",Général!#REF!,Général!B46)))","v":"Equipage 5"},{"$f":"IF($E$5=\"Course 1\",Général!B50,IF($E$5=\"Course 2\",Général!B52,IF($E$5=\"Course 3\",Général!#REF!,Général!B54)))","v":"Equipage 5"},{"$f":"IF($F$5=\"Course 1\",Général!B$58,IF($F$5=\"Course 2\",Général!B$60,IF($F$5=\"Course 3\",Général!#REF!,Général!B$62)))","v":"Equipage 10"},{"$f":"IF($G$5=\"Course 1\",Général!B$66,IF($G$5=\"Course 2\",Général!B$68,IF($G$5=\"Course 3\",Général!#REF!,Général!B$70)))","v":"Equipage 2"},{"$f":"IF($H$5=\"Course 1\",Général!B$74,IF($H$5=\"Course 2\",Général!B$76,IF($H$5=\"Course 3\",Général!#REF!,Général!B$78)))","v":"Equipage 3"},{"$f":"IF($I$5=\"Course 1\",Général!B$82,IF($I$5=\"Course 2\",Général!B$84,IF($I$5=\"Course 3\",Général!#REF!,Général!B$86)))","v":"Equipage 4"},{"$f":"IF($J$5=\"Course 1\",Général!B$90,IF($J$5=\"Course 2\",Général!B$92,IF($J$5=\"Course 3\",Général!#REF!,Général!B$94)))","v":"Equipage 6"},{"$f":"IF($K$5=\"Course 1\",Général!B$98,IF($K$5=\"Course 2\",Général!B$100,IF($K$5=\"Course 3\",Général!#REF!,Général!B$102)))","v":"Equipage 3"},{"$f":"IF($L$5=\"Course 1\",Général!B$106,IF($L$5=\"Course 2\",Général!B$108,IF($L$5=\"Course 3\",Général!#REF!,Général!B$110)))","v":"Equipage 3"},{"$f":"IF($M$5=\"Course 1\",Général!B$114,IF($M$5=\"Course 2\",Général!B$116,IF($M$5=\"Course 3\",Général!#REF!,Général!B$118)))","v":"Equipage 1"},{"$f":"IF($N$5=\"Course 1\",Général!B$122,IF($N$5=\"Course 2\",Général!B$124,IF($N$5=\"Course 3\",Général!#REF!,Général!B$126)))","v":"Equipage 8"},{"$f":"IF($O$5=\"Course 1\",Général!B$130,IF($O$5=\"Course 2\",Général!B$132,IF($O$5=\"Course 3\",Général!#REF!,Général!B$134)))","v":"Equipage 4"},{"$f":"IF($P$5=\"Course 1\",Général!B$138,IF($P$5=\"Course 2\",Général!B$140,IF($P$5=\"Course 3\",Général!#REF!,Général!B$142)))","v":"Equipage 7"},{"$f":"IF($Q$5=\"Course 1\",Général!B$146,IF($Q$5=\"Course 2\",Général!B$148,IF($Q$5=\"Course 3\",Général!#REF!,Général!B$150)))","v":"Equipage 9"},{"$f":"IF($R$5=\"Course 1\",Général!B$154,IF($R$5=\"Course 2\",Général!B$156,IF($R$5=\"Course 3\",Général!B$158,Général!B$160)))","v":"Equipage 1"},null,null,null,{"$f":"Général!B10","v":"Equipage 8"},4]
["2nd Equipage",null,{"$f":"IF($C$5=\"Course 1\",Général!C34,IF($C$5=\"Course 2\",Général!C36,IF($C$5=\"Course 3\",Général!#REF!,Général!C38)))","v":"Equipage 10"},{"$f":"IF($D$5=\"Course 1\",Général!C42,IF($D$5=\"Course 2\",Général!C44,IF($D$5=\"Course 3\",Général!#REF!,Général!C46)))","v":"Equipage 2"},{"$f":"IF($E$5=\"Course 1\",Général!C50,IF($E$5=\"Course 2\",Général!C52,IF($E$5=\"Course 3\",Général!#REF!,Général!C54)))","v":"Equipage 8"},{"$f":"IF($F$5=\"Course 1\",Général!C$58,IF($F$5=\"Course 2\",Général!C$60,IF($F$5=\"Course 3\",Général!#REF!,Général!C$62)))","v":"Equipage 7"},{"$f":"IF($G$5=\"Course 1\",Général!C$66,IF($G$5=\"Course 2\",Général!C$68,IF($G$5=\"Course 3\",Général!#REF!,Général!C$70)))","v":"Equipage 3"},{"$f":"IF($H$5=\"Course 1\",Général!C$74,IF($H$5=\"Course 2\",Général!C$76,IF($H$5=\"Course 3\",Général!#REF!,Général!C$78)))","v":"Equipage 7"},{"$f":"IF($I$5=\"Course 1\",Général!C$82,IF($I$5=\"Course 2\",Général!C$84,IF($I$5=\"Course 3\",Général!#REF!,Général!C$86)))","v":"Equipage 8"},{"$f":"IF($J$5=\"Course 1\",Général!C$90,IF($J$5=\"Course 2\",Général!C$92,IF($J$5=\"Course 3\",Général!#REF!,Général!C$94)))","v":"Equipage 9"},{"$f":"IF($K$5=\"Course 1\",Général!C$98,IF($K$5=\"Course 2\",Général!C$100,IF($K$5=\"Course 3\",Général!#REF!,Général!C$102)))","v":"Equipage 8"},{"$f":"IF($L$5=\"Course 1\",Général!C$106,IF($L$5=\"Course 2\",Général!C$108,IF($L$5=\"Course 3\",Général!#REF!,Général!C$110)))","v":"Equipage 6"},{"$f":"IF($M$5=\"Course 1\",Général!C$114,IF($M$5=\"Course 2\",Général!C$116,IF($M$5=\"Course 3\",Général!#REF!,Général!C$118)))","v":"Equipage 7"},{"$f":"IF($N$5=\"Course 1\",Général!C$122,IF($N$5=\"Course 2\",Général!C$124,IF($N$5=\"Course 3\",Général!#REF!,Général!C$126)))","v":"Equipage 5"},{"$f":"IF($O$5=\"Course 1\",Général!C$130,IF($O$5=\"Course 2\",Général!C$132,IF($O$5=\"Course 3\",Général!#REF!,Général!C$134)))","v":"Equipage 7"},{"$f":"IF($P$5=\"Course 1\",Général!C$138,IF($P$5=\"Course 2\",Général!C$140,IF($P$5=\"Course 3\",Général!#REF!,Général!C$142)))","v":"Equipage 1"},{"$f":"IF($Q$5=\"Course 1\",Général!C$146,IF($Q$5=\"Course 2\",Général!C$148,IF($Q$5=\"Course 3\",Général!#REF!,Général!C$150)))","v":"Equipage 7"},{"$f":"IF($R$5=\"Course 1\",Général!C$154,IF($R$5=\"Course 2\",Général!C$156,IF($R$5=\"Course 3\",Général!C$158,Général!C$160)))","v":"Equipage 7"},null,null,null,{"$f":"Général!B11","v":"Equipage 9"},4]
["3ème Equipage",null,{"$f":"IF($C$5=\"Course 1\",Général!D34,IF($C$5=\"Course 2\",Général!D36,IF($C$5=\"Course 3\",Général!#REF!,Général!D38)))","v":"Equipage 4"},{"$f":"IF($D$5=\"Course 1\",Général!D42,IF($D$5=\"Course 2\",Général!D44,IF($D$5=\"Course 3\",Général!#REF!,Général!D46)))","v":"Equipage 3"},{"$f":"IF($E$5=\"Course 1\",Général!D50,IF($E$5=\"Course 2\",Général!D52,IF($E$5=\"Course 3\",Général!#REF!,Général!D54)))","v":"Equipage 4"},{"$f":"IF($F$5=\"Course 1\",Général!D$58,IF($F$5=\"Course 2\",Général!D$60,IF($F$5=\"Course 3\",Général!#REF!,Général!D$62)))","v":"Equipage 3"},{"$f":"IF($G$5=\"Course 1\",Général!D$66,IF($G$5=\"Course 2\",Général!D$68,IF($G$5=\"Course 3\",Général!#REF!,Général!D$70)))","v":"Equipage 6"},{"$f":"IF($H$5=\"Course 1\",Général!D$74,IF($H$5=\"Course 2\",Général!D$76,IF($H$5=\"Course 3\",Général!#REF!,Général!D$78)))","v":"Equipage 2"},{"$f":"IF($I$5=\"Course 1\",Général!D$82,IF($I$5=\"Course 2\",Général!D$84,IF($I$5=\"Course 3\",Général!#REF!,Général!D$86)))","v":"Equipage 7"},{"$f":"IF($J$5=\"Course 1\",Général!D$90,IF($J$5=\"Course 2\",Général!D$92,IF($J$5=\"Course 3\",Général!#REF!,Général!D$94)))","v":"Equipage 5"},{"$f":"IF($K$5=\"Course 1\",Général!D$98,IF($K$5=\"Course 2\",Général!D$100,IF($K$5=\"Course 3\",Général!#REF!,Général!D$102)))","v":"Equipage 5"},{"$f":"IF($L$5=\"Course 1\",Général!D$106,IF($L$5=\"Course 2\",Général!D$108,IF($L$5=\"Course 3\",Général!#REF!,Général!D$110)))","v":"Equipage 5"},{"$f":"IF($M$5=\"Course 1\",Général!D$114,IF($M$5=\"Course 2\",Général!D$116,IF($M$5=\"Course 3\",Général!#REF!,Général!D$118)))","v":"Equipage 10"},{"$f":"IF($N$5=\"Course 1\",Général!D$122,IF($N$5=\"Course 2\",Général!D$124,IF($N$5=\"Course 3\",Général!#REF!,Général!D$126)))","v":"Equipage 7"},{"$f":"IF($O$5=\"Course 1\",Général!D$130,IF($O$5=\"Course 2\",Général!D$132,IF($O$5=\"Course 3\",Général!#REF!,Général!D$134)))","v":"Equipage 6"},{"$f":"IF($P$5=\"Course 1\",Général!D$138,IF($P$5=\"Course 2\",Général!D$140,IF($P$5=\"Course 3\",Général!#REF!,Général!D$142)))","v":"Equipage 10"},{"$f":"IF($Q$5=\"Course 1\",Général!D$146,IF($Q$5=\"Course 2\",Général!D$148,IF($Q$5=\"Course 3\",Général!#REF!,Général!D$150)))","v":"Equipage 10"},{"$f":"IF($R$5=\"Course 1\",Général!D$154,IF($R$5=\"Course 2\",Général!D$156,IF($R$5=\"Course 3\",Général!D$158,Général!D$160)))","v":"Equipage 10"},null,null,null,{"$f":"Général!B12","v":"Equipage 10"},10]
["4ème Equipage",null,{"$f":"IF($C$5=\"Course 1\",Général!E34,IF($C$5=\"Course 2\",Général!E36,IF($C$5=\"Course 3\",Général!#REF!,Général!E38)))","v":"Equipage 6"},{"$f":"IF($D$5=\"Course 1\",Général!E42,IF($D$5=\"Course 2\",Général!E44,IF($D$5=\"Course 3\",Général!#REF!,Général!E46)))","v":"Equipage 1"},{"$f":"IF($E$5=\"Course 1\",Général!E50,IF($E$5=\"Course 2\",Général!E52,IF($E$5=\"Course 3\",Général!#REF!,Général!E54)))","v":"Equipage 10"},{"$f":"IF($F$5=\"Course 1\",Général!E$58,IF($F$5=\"Course 2\",Général!E$60,IF($F$5=\"Course 3\",Général!#REF!,Général!E$62)))","v":"Equipage 9"},{"$f":"IF($G$5=\"Course 1\",Général!E$66,IF($G$5=\"Course 2\",Général!E$68,IF($G$5=\"Course 3\",Général!#REF!,Général!E$70)))","v":"Equipage 9"},{"$f":"IF($H$5=\"Course 1\",Général!E$74,IF($H$5=\"Course 2\",Général!E$76,IF($H$5=\"Course 3\",Général!#REF!,Général!E$78)))","v":"Equipage 6"},{"$f":"IF($I$5=\"Course 1\",Général!E$82,IF($I$5=\"Course 2\",Général!E$84,IF($I$5=\"Course 3\",Général!#REF!,Général!E$86)))","v":"Equipage 10"},{"$f":"IF($J$5=\"Course 1\",Général!E$90,IF($J$5=\"Course 2\",Général!E$92,IF($J$5=\"Course 3\",Général!#REF!,Général!E$94)))","v":"Equipage 4"},{"$f":"IF($K$5=\"Course 1\",Général!E$98,IF($K$5=\"Course 2\",Général!E$100,IF($K$5=\"Course 3\",Général!#REF!,Général!E$102)))","v":"Equipage 7"},{"$f":"IF($L$5=\"Course 1\",Général!E$106,IF($L$5=\"Course 2\",Général!E$108,IF($L$5=\"Course 3\",Général!#REF!,Général!E$110)))","v":"Equipage 7"},{"$f":"IF($M$5=\"Course 1\",Général!E$114,IF($M$5=\"Course 2\",Général!E$116,IF($M$5=\"Course 3\",Général!#REF!,Général!E$118)))","v":"Equipage 4"},{"$f":"IF($N$5=\"Course 1\",Général!E$122,IF($N$5=\"Course 2\",Général!E$124,IF($N$5=\"Course 3\",Général!#REF!,Général!E$126)))","v":"Equipage 1"},{"$f":"IF($O$5=\"Course 1\",Général!E$130,IF($O$5=\"Course 2\",Général!E$132,IF($O$5=\"Course 3\",Général!#REF!,Général!E$134)))","v":"Equipage 5"},{"$f":"IF($P$5=\"Course 1\",Général!E$138,IF($P$5=\"Course 2\",Général!E$140,IF($P$5=\"Course 3\",Général!#REF!,Général!E$142)))","v":"Equipage 4"},{"$f":"IF($Q$5=\"Course 1\",Général!E$146,IF($Q$5=\"Course 2\",Général!E$148,IF($Q$5=\"Course 3\",Général!#REF!,Général!E$150)))","v":"Equipage 6"},{"$f":"IF($R$5=\"Course 1\",Général!E$154,IF($R$5=\"Course 2\",Général!E$156,IF($R$5=\"Course 3\",Général!E$158,Général!E$160)))","v":"Equipage 6"}]
["5ème Equipage",null,{"$f":"IF($C$5=\"Course 1\",Général!F34,IF($C$5=\"Course 2\",Général!F36,IF($C$5=\"Course 3\",Général!#REF!,Général!F38)))","v":"Equipage 1"},{"$f":"IF($D$5=\"Course 1\",Général!F42,IF($D$5=\"Course 2\",Général!F44,IF($D$5=\"Course 3\",Général!#REF!,Général!F46)))","v":"Equipage 7"},{"$f":"IF($E$5=\"Course 1\",Général!F50,IF($E$5=\"Course 2\",Général!F52,IF($E$5=\"Course 3\",Général!#REF!,Général!F54)))","v":"Equipage 7"},{"$f":"IF($F$5=\"Course 1\",Général!F$58,IF($F$5=\"Course 2\",Général!F$60,IF($F$5=\"Course 3\",Général!#REF!,Général!F$62)))","v":"Equipage 6"},{"$f":"IF($G$5=\"Course 1\",Général!F$66,IF($G$5=\"Course 2\",Général!F$68,IF($G$5=\"Course 3\",Général!#REF!,Général!F$70)))","v":"Equipage 7"},{"$f":"IF($H$5=\"Course 1\",Général!F$74,IF($H$5=\"Course 2\",Général!F$76,IF($H$5=\"Course 3\",Général!#REF!,Général!F$78)))","v":"Equipage 1"},{"$f":"IF($I$5=\"Course 1\",Général!F$82,IF($I$5=\"Course 2\",Général!F$84,IF($I$5=\"Course 3\",Général!#REF!,Général!F$86)))","v":"Equipage 5"},{"$f":"IF($J$5=\"Course 1\",Général!F$90,IF($J$5=\"Course 2\",Général!F$92,IF($J$5=\"Course 3\",Général!#REF!,Général!F$94)))","v":"Equipage 7"},{"$f":"IF($K$5=\"Course 1\",Général!F$98,IF($K$5=\"Course 2\",Général!F$100,IF($K$5=\"Course 3\",Général!#REF!,Général!F$102)))","v":"Equipage 10"},{"$f":"IF($L$5=\"Course 1\",Général!F$106,IF($L$5=\"Course 2\",Général!$F108,IF($L$5=\"Course 3\",Général!#REF!,Général!F$110)))","v":"Equipage 2"},{"$f":"IF($M$5=\"Course 1\",Général!F$114,IF($M$5=\"Course 2\",Général!F$116,IF($M$5=\"Course 3\",Général!#REF!,Général!F$118)))","v":"Equipage 3"},{"$f":"IF($N$5=\"Course 1\",Général!F$122,IF($N$5=\"Course 2\",Général!F$124,IF($N$5=\"Course 3\",Général!#REF!,Général!F$126)))","v":"Equipage 4"},{"$f":"IF($O$5=\"Course 1\",Général!F$130,IF($O$5=\"Course 2\",Général!F$132,IF($O$5=\"Course 3\",Général!#REF!,Général!F$134)))","v":"Equipage 10"},{"$f":"IF($P$5=\"Course 1\",Général!F$138,IF($P$5=\"Course 2\",Général!F$140,IF($P$5=\"Course 3\",Général!#REF!,Général!F$142)))","v":"Equipage 3"},{"$f":"IF($Q$5=\"Course 1\",Général!F$146,IF($Q$5=\"Course 2\",Général!F$148,IF($Q$5=\"Course 3\",Général!#REF!,Général!F$150)))","v":"Equipage 3"},{"$f":"IF($R$5=\"Course 1\",Général!F$154,IF($R$5=\"Course 2\",Général!F$156,IF($R$5=\"Course 3\",Général!F$158,Général!F$160)))","v":"Equipage 4"}]
["7ème Equipage",null,{"$f":"IF($C$5=\"Course 1\",Général!H34,IF($C$5=\"Course 2\",Général!H36,IF($C$5=\"Course 3\",Général!#REF!,Général!H38)))","v":0},{"$f":"IF($D$5=\"Course 1\",Général!H42,IF($D$5=\"Course 2\",Général!H44,IF($D$5=\"Course 3\",Général!#REF!,Général!H46)))","v":0},{"$f":"IF($E$5=\"Course 1\",Général!H50,IF($E$5=\"Course 2\",Général!H52,IF($E$5=\"Course 3\",Général!#REF!,Général!H54)))","v":0},{"$f":"IF($F$5=\"Course 1\",Général!H$58,IF($F$5=\"Course 2\",Général!H$60,IF($F$5=\"Course 3\",Général!#REF!,Général!H$62)))","v":0},{"$f":"IF($G$5=\"Course 1\",Général!H$66,IF($G$5=\"Course 2\",Général!H$68,IF($G$5=\"Course 3\",Général!#REF!,Général!H$70)))","v":0},{"$f":"IF($H$5=\"Course 1\",Général!H$74,IF($H$5=\"Course 2\",Général!H$76,IF($H$5=\"Course 3\",Général!#REF!,Général!H$78)))","v":0},{"$f":"IF($I$5=\"Course 1\",Général!H$82,IF($I$5=\"Course 2\",Général!H$84,IF($I$5=\"Course 3\",Général!#REF!,Général!H$86)))","v":0},{"$f":"IF($J$5=\"Course 1\",Général!H$90,IF($J$5=\"Course 2\",Général!H$92,IF($J$5=\"Course 3\",Général!#REF!,Général!H$94)))","v":0},{"$f":"IF($K$5=\"Course 1\",Général!H$98,IF($K$5=\"Course 2\",Général!H$100,IF($K$5=\"Course 3\",Général!#REF!,Général!H$102)))","v":0},{"$f":"IF($L$5=\"Course 1\",Général!H$106,IF($L$5=\"Course 2\",Général!H$108,IF($L$5=\"Course 3\",Général!#REF!,Général!H$110)))","v":0},{"$f":"IF($M$5=\"Course 1\",Général!H$114,IF($M$5=\"Course 2\",Général!H$116,IF($M$5=\"Course 3\",Général!#REF!,Général!H$118)))","v":0},{"$f":"IF($N$5=\"Course 1\",Général!H$122,IF($N$5=\"Course 2\",Général!H$124,IF($N$5=\"Course 3\",Général!#REF!,Général!H$126)))","v":0},{"$f":"IF($O$5=\"Course 1\",Général!H$130,IF($O$5=\"Course 2\",Général!H$132,IF($O$5=\"Course 3\",Général!#REF!,Général!H$134)))","v":0},{"$f":"IF($P$5=\"Course 1\",Général!H$138,IF($P$5=\"Course 2\",Général!H$140,IF($P$5=\"Course 3\",Général!#REF!,Général!H$142)))","v":0},{"$f":"IF($Q$5=\"Course 1\",Général!H$146,IF($Q$5=\"Course 2\",Général!H$148,IF($Q$5=\"Course 3\",Général!#REF!,Général!H$150)))","v":0},{"$f":"IF($R$5=\"Course 1\",Général!H$154,IF($R$5=\"Course 2\",Général!H$156,IF($R$5=\"Course 3\",Général!H$158,Général!H$160)))","v":0},null,null,null,{"$f":"Général!B14","v":"Equipage 14"},{"$f":"COUNTIF($C$8:$R$16,V13)","v":0}]
["8ème Equipage",null,{"$f":"IF($C$5=\"Course 1\",Général!I34,IF($C$5=\"Course 2\",Général!I36,IF($C$5=\"Course 3\",Général!#REF!,Général!I38)))","v":0},{"$f":"IF($D$5=\"Course 1\",Général!I42,IF($D$5=\"Course 2\",Général!I44,IF($D$5=\"Course 3\",Général!#REF!,Général!I46)))","v":0},{"$f":"IF($E$5=\"Course 1\",Général!I50,IF($E$5=\"Course 2\",Général!I52,IF($E$5=\"Course 3\",Général!#REF!,Général!I54)))","v":0},{"$f":"IF($F$5=\"Course 1\",Général!I$58,IF($F$5=\"Course 2\",Général!I$60,IF($F$5=\"Course 3\",Général!#REF!,Général!I$62)))","v":0},{"$f":"IF($G$5=\"Course 1\",Général!I$66,IF($G$5=\"Course 2\",Général!I$68,IF($G$5=\"Course 3\",Général!#REF!,Général!I$70)))","v":0},{"$f":"IF($H$5=\"Course 1\",Général!I$74,IF($H$5=\"Course 2\",Général!I$76,IF($H$5=\"Course 3\",Général!#REF!,Général!I$78)))","v":0},{"$f":"IF($I$5=\"Course 1\",Général!I$82,IF($I$5=\"Course 2\",Général!I$84,IF($I$5=\"Course 3\",Général!#REF!,Général!I$86)))","v":0},{"$f":"IF($J$5=\"Course 1\",Général!I$90,IF($J$5=\"Course 2\",Général!I$92,IF($J$5=\"Course 3\",Général!#REF!,Général!I$94)))","v":0},{"$f":"IF($K$5=\"Course 1\",Général!I$98,IF($K$5=\"Course 2\",Général!I$100,IF($K$5=\"Course 3\",Général!#REF!,Général!I$102)))","v":0},{"$f":"IF($L$5=\"Course 1\",Général!I$106,IF($L$5=\"Course 2\",Général!I$108,IF($L$5=\"Course 3\",Général!#REF!,Général!I$110)))","v":0},{"$f":"IF($M$5=\"Course 1\",Général!I$114,IF($M$5=\"Course 2\",Général!I$116,IF($M$5=\"Course 3\",Général!#REF!,Général!I$118)))","v":0},{"$f":"IF($N$5=\"Course 1\",Général!I$122,IF($N$5=\"Course 2\",Général!I$124,IF($N$5=\"Course 3\",Général!#REF!,Général!I$126)))","v":0},{"$f":"IF($O$5=\"Course 1\",Général!I$130,IF($O$5=\"Course 2\",Général!I$132,IF($O$5=\"Course 3\",Général!#REF!,Général!I$134)))","v":0},{"$f":"IF($P$5=\"Course 1\",Général!I$138,IF($P$5=\"Course 2\",Général!I$140,IF($P$5=\"Course 3\",Général!#REF!,Général!I$142)))","v":0},{"$f":"IF($Q$5=\"Course 1\",Général!I$146,IF($Q$5=\"Course 2\",Général!I$148,IF($Q$5=\"Course 3\",Général!#REF!,Général!I$150)))","v":0},{"$f":"IF($R$5=\"Course 1\",Général!I$154,IF($R$5=\"Course 2\",Général!I$156,IF($R$5=\"Course 3\",Général!I$158,Général!I$160)))","v":0},null,null,null,{"$f":"Général!B15","v":"Equipage 15"},0]
["9ème Equipage",null,{"$f":"IF($C$5=\"Course 1\",Général!J34,IF($C$5=\"Course 2\",Général!J36,IF($C$5=\"Course 3\",Général!#REF!,Général!J38)))","v":0},{"$f":"IF($D$5=\"Course 1\",Général!J42,IF($D$5=\"Course 2\",Général!J44,IF($D$5=\"Course 3\",Général!#REF!,Général!J46)))","v":0},{"$f":"IF($E$5=\"Course 1\",Général!J50,IF($E$5=\"Course 2\",Général!J52,IF($E$5=\"Course 3\",Général!#REF!,Général!J54)))","v":0},{"$f":"IF($F$5=\"Course 1\",Général!J$58,IF($F$5=\"Course 2\",Général!J$60,IF($F$5=\"Course 3\",Général!#REF!,Général!J$62)))","v":0},{"$f":"IF($G$5=\"Course 1\",Général!J$66,IF($G$5=\"Course 2\",Général!J$68,IF($G$5=\"Course 3\",Général!#REF!,Général!J$70)))","v":0},{"$f":"IF($H$5=\"Course 1\",Général!J$74,IF($H$5=\"Course 2\",Général!J$76,IF($H$5=\"Course 3\",Général!#REF!,Général!J$78)))","v":0},{"$f":"IF($I$5=\"Course 1\",Général!J$82,IF($I$5=\"Course 2\",Général!J$84,IF($I$5=\"Course 3\",Général!#REF!,Général!J$86)))","v":0},{"$f":"IF($J$5=\"Course 1\",Général!J$90,IF($J$5=\"Course 2\",Général!J$92,IF($J$5=\"Course 3\",Général!#REF!,Général!J$94)))","v":0},{"$f":"IF($K$5=\"Course 1\",Général!J$98,IF($K$5=\"Course 2\",Général!J$100,IF($K$5=\"Course 3\",Général!#REF!,Général!J$102)))","v":0},{"$f":"IF($L$5=\"Course 1\",Général!J$106,IF($L$5=\"Course 2\",Général!J$108,IF($L$5=\"Course 3\",Général!#REF!,Général!J$110)))","v":0},{"$f":"IF($M$5=\"Course 1\",Général!J$114,IF($M$5=\"Course 2\",Général!J$116,IF($M$5=\"Course 3\",Général!#REF!,Général!J$118)))","v":0},{"$f":"IF($N$5=\"Course 1\",Général!J$122,IF($N$5=\"Course 2\",Général!J$124,IF($N$5=\"Course 3\",Général!#REF!,Général!J$126)))","v":0},{"$f":"IF($O$5=\"Course 1\",Général!J$130,IF($O$5=\"Course 2\",Général!J$132,IF($O$5=\"Course 3\",Général!#REF!,Général!J$134)))","v":0},{"$f":"IF($P$5=\"Course 1\",Général!J$138,IF($P$5=\"Course 2\",Général!J$140,IF($P$5=\"Course 3\",Général!#REF!,Général!J$142)))","v":0},{"$f":"IF($Q$5=\"Course 1\",Général!J$146,IF($Q$5=\"Course 2\",Général!J$148,IF($Q$5=\"Course 3\",Général!#REF!,Général!J$150)))","v":0},{"$f":"IF($R$5=\"Course 1\",Général!J$154,IF($R$5=\"Course 2\",Général!J$156,IF($R$5=\"Course 3\",Général!J$158,Général!J$160)))","v":0},null,null,null,{"$f":"Général!B16","v":"Equipage 16"},0]
["10ème Equipage",null,{"$f":"IF($C$5=\"Course 1\",Général!K34,IF($C$5=\"Course 2\",Général!K36,IF($C$5=\"Course 3\",Général!#REF!,Général!K38)))","v":0},{"$f":"IF($D$5=\"Course 1\",Général!K42,IF($D$5=\"Course 2\",Général!K44,IF($D$5=\"Course 3\",Général!#REF!,Général!K46)))","v":0},{"$f":"IF($E$5=\"Course 1\",Général!K50,IF($E$5=\"Course 2\",Général!K52,IF($E$5=\"Course 3\",Général!#REF!,Général!K54)))","v":0},{"$f":"IF($F$5=\"Course 1\",Général!K$58,IF($F$5=\"Course 2\",Général!K$60,IF($F$5=\"Course 3\",Général!#REF!,Général!K$62)))","v":0},{"$f":"IF($G$5=\"Course 1\",Général!K$66,IF($G$5=\"Course 2\",Général!K$68,IF($G$5=\"Course 3\",Général!#REF!,Général!K$70)))","v":0},{"$f":"IF($H$5=\"Course 1\",Général!K$74,IF($H$5=\"Course 2\",Général!K$76,IF($H$5=\"Course 3\",Général!#REF!,Général!K$78)))","v":0},{"$f":"IF($I$5=\"Course 1\",Général!K$82,IF($I$5=\"Course 2\",Général!K$84,IF($I$5=\"Course 3\",Général!#REF!,Général!K$86)))","v":0},{"$f":"IF($J$5=\"Course 1\",Général!K$90,IF($J$5=\"Course 2\",Général!K$92,IF($J$5=\"Course 3\",Général!#REF!,Général!K$94)))","v":0},{"$f":"IF($K$5=\"Course 1\",Général!K$98,IF($K$5=\"Course 2\",Général!K$100,IF($K$5=\"Course 3\",Général!#REF!,Général!K$102)))","v":0},{"$f":"IF($L$5=\"Course 1\",Général!K$106,IF($L$5=\"Course 2\",Général!K$108,IF($L$5=\"Course 3\",Général!#REF!,Général!K$110)))","v":0},{"$f":"IF($M$5=\"Course 1\",Général!K$114,IF($M$5=\"Course 2\",Général!K$116,IF($M$5=\"Course 3\",Général!#REF!,Général!K$118)))","v":0},{"$f":"IF($N$5=\"Course 1\",Général!K$122,IF($N$5=\"Course 2\",Général!K$124,IF($N$5=\"Course 3\",Général!#REF!,Général!K$126)))","v":0},{"$f":"IF($O$5=\"Course 1\",Général!K$130,IF($O$5=\"Course 2\",Général!K$132,IF($O$5=\"Course 3\",Général!#REF!,Général!K$134)))","v":0},{"$f":"IF($P$5=\"Course 1\",Général!K$138,IF($P$5=\"Course 2\",Général!K$140,IF($P$5=\"Course 3\",Général!#REF!,Général!K$142)))","v":0},{"$f":"IF($Q$5=\"Course 1\",Général!K$146,IF($Q$5=\"Course 2\",Général!K$148,IF($Q$5=\"Course 3\",Général!#REF!,Général!K$150)))","v":0},{"$f":"IF($R$5=\"Course 1\",Général!K$154,IF($R$5=\"Course 2\",Général!K$156,IF($R$5=\"Course 3\",Général!K$158,Général!K$160)))","v":0},null,null,null,{"$f":"Général!B17","v":"Equipage 17"},0]
[null,null,null,null,null,null,null,null,null,null,null,null,null,null,null,null,null,null,null,null,null,{"$f":"Général!B18","v":"Equipage 18"},0]
[null,null,null,null,null,null,null,null,null,null,null,null,null,null,null,null,null,null,null,null,null,{"$f":"Général!B19","v":"Equipage 19"},0]
[null,null,null,null,null,null,null,null,null,null,null,null,null,null,null,null,null,null,null,null,null,{"$f":"Général!B20","v":"Equipage 20"},0]
[null,null,null,null,null,null,null,null,null,null,null,null,null,null,null,null,null,null,null,null,null,{"$f":"Général!B21","v":"Equipage 21"},0]
[null,null,null,null,null,null,null,null,null,null,null,null,null,null,null,null,null,null,null,null,null,{"$f":"Général!B22","v":"Equipage 22"},0]
[null,null,null,null,null,null,null,null,null,null,null,null,null,null,null,null,null,null,null,null,null,{"$f":"Général!B23","v":"Equipage 23"},0]
[null,null,null,null,null,null,null,null,null,null,null,null,null,null,null,null,null,null,null,null,null,{"$f":"Général!B24","v":"Equipage 24"},0]
[null,null,null,null,null,null,null,null,null,null,null,null,null,null,null,null,null,null,null,null,null,{"$f":"Général!B25","v":"Equipage 25"},0]
[null,null,null,null,null,null,null,null,null,null,null,null,null,null,null,null,null,null,null,null,null,{"$f":"Général!B26","v":"Equipage 26"},0]
[null,null,null,null,null,null,null,null,null,null,null,null,null,null,null,null,null,null,null,null,null,{"$f":"Général!B27","v":"Equipage 27"},0]
[null,null,null,null,null,null,null,null,null,null,null,null,null,null,null,null,null,null,null,null,null,{"$f":"Général!B28","v":"Equipage 28"},0]
[null,null,null,null,null,null,null,null,null,null,null,null,null,null,null,null,null,null,null,null,null,{"$f":"Général!B29","v":"Equipage 29"},0]
[null,null,null,null,null,null,null,null,null,null,null,null,null,null,null,null,null,null,null,null,null,{"$f":"Général!B30","v":"Equipage 30"},0]

{"sheet":"Eq.8","index":13,"n_rows":29,"n_cols":23,"rows_kept":29,"cut":false,"hidden":true,"merged":[[7,0,7,1],[0,0,1,5],[0,6,1,10],[3,0,3,1],[4,0,4,1],[5,0,5,1],[14,0,14,1],[15,0,15,1],[8,0,8,1],[9,0,9,1],[10,0,10,1],[11,0,11,1],[12,0,12,1],[13,0,13,1]]}
["Equipage ",null,null,null,null,null,{"$f":"Général!B10","v":"Equipage 8"},null,null,null,null,null,null,null,null,null,null,null,null,null,null,{"$f":"Général!B3","v":"Equipage 1"},{"$f":"COUNTIF(C$8:R$16,V1)","v":7}]
[null,null,null,null,null,null,null,null,null,null,null,null,null,null,null,null,null,null,null,null,null,{"$f":"Général!B4","v":"Equipage 2"},{"$f":"COUNTIF($C$8:$R$16,V2)","v":8}]
[null,null,null,null,null,null,null,null,null,null,null,null,null,null,null,null,null,null,null,null,null,{"$f":"Général!B5","v":"Equipage 3"},5]
[null,null,"FLIGHT 1","FLIGHT 2","FLIGHT 3","FLIGHT 4","FLIGHT 5","FLIGHT 6","FLIGHT 7","FLIGHT 8","FLIGHT 9","FLIGHT 10","FLIGHT 11","FLIGHT 12","FLIGHT 13","FLIGHT 14","FLIGHT 15","FLIGHT 16","FLIGHT 17","FLIGHT 18",null,{"$f":"Général!B6","v":"Equipage 4"},9]
["N° de course",null,{"$f":"IF(COUNTIF(Général!B34:K34,$G$1)=1,\"Course 1\",IF(COUNTIF(Général!B36:K36,$G$1)=1,\"Course 2\",IF(COUNTIF(Général!#REF!,$G$1)=1,\"Course 3\",\"Course 4\")))","v":"Course 2"},{"$f":"IF(COUNTIF(Général!B42:K42,$G$1)=1,\"Course 1\",IF(COUNTIF(Général!B44:K44,$G$1)=1,\"Course 2\",IF(COUNTIF(Général!#REF!,$G$1)=1,\"Course 3\",\"Course 4\")))","v":"Course 1"},{"$f":"IF(COUNTIF(Général!B50:K50,$G$1)=1,\"Course 1\",IF(COUNTIF(Général!B52:K52,$G$1)=1,\"Course 2\",IF(COUNTIF(Général!#REF!,$G$1)=1,\"Course 3\",\"Course 4\")))","v":"Course 1"},{"$f":"IF(COUNTIF(Général!B58:K58,$G$1)=1,\"Course 1\",IF(COUNTIF(Général!B60:K60,$G$1)=1,\"Course 2\",IF(COUNTIF(Général!#REF!,$G$1)=1,\"Course 3\",\"Course 4\")))","v":"Course 2"},{"$f":"IF(COUNTIF(Général!B66:K66,$G$1)=1,\"Course 1\",IF(COUNTIF(Général!B68:K68,$G$1)=1,\"Course 2\",IF(COUNTIF(Général!#REF!,$G$1)=1,\"Course 3\",\"Course 4\")))","v":"Course 2"},{"$f":"IF(COUNTIF(Général!B74:K74,$G$1)=1,\"Course 1\",IF(COUNTIF(Général!B76:K76,$G$1)=1,\"Course 2\",IF(COUNTIF(Général!#REF!,$G$1)=1,\"Course 3\",\"Course 4\")))","v":"Course 2"},{"$f":"IF(COUNTIF(Général!B82:K82,$G$1)=1,\"Course 1\",IF(COUNTIF(Général!B84:K84,$G$1)=1,\"Course 2\",IF(COUNTIF(Général!#REF!,$G$1)=1,\"Course 3\",\"Course 4\")))","v":"Course 1"},{"$f":"IF(COUNTIF(Général!B90:K90,$G$1)=1,\"Course 1\",IF(COUNTIF(Général!B92:K92,$G$1)=1,\"Course 2\",IF(COUNTIF(Général!#REF!,$G$1)=1,\"Course 3\",\"Course 4\")))","v":"Course 2"},{"$f":"IF(COUNTIF(Général!B98:K98,$G$1)=1,\"Course 1\",IF(COUNTIF(Général!B100:K100,$G$1)=1,\"Course 2\",IF(COUNTIF(Général!#REF!,$G$1)=1,\"Course 3\",\"Course 4\")))","v":"Course 2"},{"$f":"IF(COUNTIF(Général!B106:K106,$G$1)=1,\"Course 1\",IF(COUNTIF(Général!B108:K108,$G$1)=1,\"Course 2\",IF(COUNTIF(Général!#REF!,$G$1)=1,\"Course 3\",\"Course 4\")))","v":"Course 2"},{"$f":"IF(COUNTIF(Général!B114:K114,$G$1)=1,\"Course 1\",IF(COUNTIF(Général!B116:K116,$G$1)=1,\"Course 2\",IF(COUNTIF(Général!#REF!,$G$1)=1,\"Course 3\",\"Course 4\")))","v":"Course 1"},{"$f":"IF(COUNTIF(Général!B122:K122,$G$1)=1,\"Course 1\",IF(COUNTIF(Général!B124:K124,$G$1)=1,\"Course 2\",IF(COUNTIF(Général!#REF!,$G$1)=1,\"Course 3\",\"Course 4\")))","v":"Course 2"},{"$f":"IF(COUNTIF(Général!B130:K130,$G$1)=1,\"Course 1\",IF(COUNTIF(Général!B132:K132,$G$1)=1,\"Course 2\",IF(COUNTIF(Général!#REF!,$G$1)=1,\"Course 3\",\"Course 4\")))","v":"Course 1"},{"$f":"IF(COUNTIF(Général!B138:K138,$G$1)=1,\"Course 1\",IF(COUNTIF(Général!B140:K140,$G$1)=1,\"Course 2\",IF(COUNTIF(Général!#REF!,$G$1)=1,\"Course 3\",\"Course 4\")))","v":"Course 1"},{"$f":"IF(COUNTIF(Général!B146:K146,$G$1)=1,\"Course 1\",IF(COUNTIF(Général!B148:K148,$G$1)=1,\"Course 2\",IF(COUNTIF(Général!#REF!,$G$1)=1,\"Course 3\",\"Course 4\")))","v":"Course 1"},{"$f":"IF(COUNTIF(Général!B154:K154,$G$1)=1,\"Course 1\",IF(COUNTIF(Général!B156:K156,$G$1)=1,\"Course 2\",IF(COUNTIF(Général!B158:K158,$G$1)=1,\"Course 3\",\"Course 4\")))","v":"Course 2"},{"$f":"IF(COUNTIF(Général!C154:L154,$G$1)=1,\"Course 1\",IF(COUNTIF(Général!C156:L156,$G$1)=1,\"Course 2\",IF(COUNTIF(Général!C158:L158,$G$1)=1,\"Course 3\",\"Course 4\")))","v":"Course 2"},{"$f":"IF(COUNTIF(Général!D154:M154,$G$1)=1,\"Course 1\",IF(COUNTIF(Général!D156:M156,$G$1)=1,\"Course 2\",IF(COUNTIF(Général!D158:M158,$G$1)=1,\"Course 3\",\"Course 4\")))","v":"Course 2"},null,{"$f":"Général!B7","v":"Equipage 5"},12]
["Bateau",null,{"$f":"IF(COUNTIF(Général!B34:B38,$G$1)=1,\"Boat 1\",IF(COUNTIF(Général!C34:C38,$G$1)=1,\"Boat 2\",IF(COUNTIF(Général!D34:D38,$G$1)=1,\"Boat 3\",IF(COUNTIF(Général!E34:E38,$G$1)=1,\"Boat 4\",IF(COUNTIF(Général!F34:F38,$G$1)=1,\"Boat 5\",IF(COUNTIF(Général!G34:G38,$G$1)=1,\"Boat 6\",IF(COUNTIF(Général!H34:H38,$G$1)=1,\"Boat 7\",IF(COUNTIF(Général!I34:I38,$G$1)=1,\"Boat 8\",IF(COUNTIF(Général!J34:J38,$G$1)=1,\"Boat 9\",\"Boat10\")))))))))","v":"Boat 1"},{"$f":"IF(COUNTIF(Général!B42:B46,$G$1)=1,\"Boat 1\",IF(COUNTIF(Général!C42:C46,$G$1)=1,\"Boat 2\",IF(COUNTIF(Général!D42:D46,$G$1)=1,\"Boat 3\",IF(COUNTIF(Général!E42:E46,$G$1)=1,\"Boat 4\",IF(COUNTIF(Général!F42:F46,$G$1)=1,\"Boat 5\",IF(COUNTIF(Général!G42:G46,$G$1)=1,\"Boat 6\",IF(COUNTIF(Général!H42:H46,$G$1)=1,\"Boat 7\",IF(COUNTIF(Général!I42:I46,$G$1)=1,\"Boat 8\",IF(COUNTIF(Général!J42:J46,$G$1)=1,\"Boat 9\",\"Boat 10\")))))))))","v":"Boat 1"},{"$f":"IF(COUNTIF(Général!B50:B54,$G$1)=1,\"Boat 1\",IF(COUNTIF(Général!C50:C54,$G$1)=1,\"Boat 2\",IF(COUNTIF(Général!D50:D54,$G$1)=1,\"Boat 3\", IF(COUNTIF(Général!E50:E54,$G$1)=1,\"Boat 4\", IF(COUNTIF(Général!F50:F54,$G$1)=1,\"Boat 5\", IF(COUNTIF(Général!G50:G54,$G$1)=1,\"Boat 6\", IF(COUNTIF(Général!H50:H54,$G$1)=1,\"Boat 7\",IF(COUNTIF(Général!I50:I54,$G$1)=1,\"Boat 8\",IF(COUNTIF(Général!J50:J54,$G$1)=1,\"Boat 9\",\"Boat 10\")))))))))","v":"Boat 2"},{"$f":"IF(COUNTIF(Général!B58:B62,$G$1)=1,\"Boat 1\",IF(COUNTIF(Général!C58:C62,$G$1)=1,\"Boat 2\",IF(COUNTIF(Général!D58:D62,$G$1)=1,\"Boat 3\", IF(COUNTIF(Général!E58:E62,$G$1)=1,\"Boat 4\", IF(COUNTIF(Général!F58:F62,$G$1)=1,\"Boat 5\", IF(COUNTIF(Général!G58:G62,$G$1)=1,\"Boat 6\", IF(COUNTIF(Général!H58:H62,$G$1)=1,\"Boat 7\",IF(COUNTIF(Général!I58:I62,$G$1)=1,\"Boat 8\",IF(COUNTIF(Général!I58:J62,$G$1)=1,\"Boat 9\",\"Boat 10\")))))))))","v":"Boat 3"},{"$f":"IF(COUNTIF(Général!B66:B70,$G$1)=1,\"Boat 1\",IF(COUNTIF(Général!C66:C70,$G$1)=1,\"Boat 2\",IF(COUNTIF(Général!D66:D70,$G$1)=1,\"Boat 3\", IF(COUNTIF(Général!E66:E70,$G$1)=1,\"Boat 4\", IF(COUNTIF(Général!F66:F70,$G$1)=1,\"Boat 5\", IF(COUNTIF(Général!G66:G70,$G$1)=1,\"Boat 6\", IF(COUNTIF(Général!H66:H70,$G$1)=1,\"Boat 7\",IF(COUNTIF(Général!I66:I70,$G$1)=1,\"Boat 8\",IF(COUNTIF(Général!J66:J70,$G$1)=1,\"Boat 9\",\"Boat 10\")))))))))","v":"Boat 3"},{"$f":"IF(COUNTIF(Général!B74:B78,$G$1)=1,\"Boat 1\",IF(COUNTIF(Général!C74:C78,$G$1)=1,\"Boat 2\",IF(COUNTIF(Général!D74:D78,$G$1)=1,\"Boat 3\", IF(COUNTIF(Général!E74:E78,$G$1)=1,\"Boat 4\", IF(COUNTIF(Général!F74:F78,$G$1)=1,\"Boat 5\", IF(COUNTIF(Général!G74:G78,$G$1)=1,\"Boat 6\", IF(COUNTIF(Général!H74:H78,$G$1)=1,\"Boat 7\",IF(COUNTIF(Général!I74:I78,$G$1)=1,\"Boat 8\",IF(COUNTIF(Général!J74:J78,$G$1)=1,\"Boat 9\",\"Boat 10\")))))))))","v":"Boat 2"},{"$f":"IF(COUNTIF(Général!B82:B86,$G$1)=1,\"Boat 1\",IF(COUNTIF(Général!C82:C86,$G$1)=1,\"Boat 2\",IF(COUNTIF(Général!D82:D86,$G$1)=1,\"Boat 3\", IF(COUNTIF(Général!E82:E86,$G$1)=1,\"Boat 4\", IF(COUNTIF(Général!F82:F86,$G$1)=1,\"Boat 5\", IF(COUNTIF(Général!G82:G86,$G$1)=1,\"Boat 6\", IF(COUNTIF(Général!H82:H86,$G$1)=1,\"Boat 7\",IF(COUNTIF(Général!I82:I86,$G$1)=1,\"Boat 8\",IF(COUNTIF(Général!J82:J86,$G$1)=1,\"Boat 9\",\"Boat 10\")))))))))","v":"Boat 2"},{"$f":"IF(COUNTIF(Général!B90:B94,$G$1)=1,\"Boat 1\",IF(COUNTIF(Général!C90:C94,$G$1)=1,\"Boat 2\",IF(COUNTIF(Général!D90:D94,$G$1)=1,\"Boat 3\", IF(COUNTIF(Général!E90:E94,$G$1)=1,\"Boat 4\", IF(COUNTIF(Général!F90:F94,$G$1)=1,\"Boat 5\", IF(COUNTIF(Général!G90:G94,$G$1)=1,\"Boat 6\", IF(COUNTIF(Général!H90:H94,$G$1)=1,\"Boat 7\",IF(COUNTIF(Général!I90:I94,$G$1)=1,\"Boat 8\",IF(COUNTIF(Général!J90:J94,$G$1)=1,\"Boat 9\",\"Boat 10\")))))))))","v":"Boat 5"},{"$f":"IF(COUNTIF(Général!B98:B102,$G$1)=1,\"Boat 1\",IF(COUNTIF(Général!C98:C102,$G$1)=1,\"Boat 2\",IF(COUNTIF(Général!D98:D102,$G$1)=1,\"Boat 3\", IF(COUNTIF(Général!E98:E102,$G$1)=1,\"Boat 4\", IF(COUNTIF(Général!F98:F102,$G$1)=1,\"Boat 5\", IF(COUNTIF(Général!G98:G102,$G$1)=1,\"Boat 6\", IF(COUNTIF(Général!H98:H102,$G$1)=1,\"Boat 7\",IF(COUNTIF(Général!I98:I102,$G$1)=1,\"Boat 8\",IF(COUNTIF(Général!J98:J102,$G$1)=1,\"Boat 9\",\"Boat 10\")))))))))","v":"Boat 2"},{"$f":"IF(COUNTIF(Général!B106:B110,$G$1)=1,\"Boat 1\",IF(COUNTIF(Général!C106:C110,$G$1)=1,\"Boat 2\",IF(COUNTIF(Général!D106:D110,$G$1)=1,\"Boat 3\", IF(COUNTIF(Général!E106:E110,$G$1)=1,\"Boat 4\", IF(COUNTIF(Général!F106:F110,$G$1)=1,\"Boat 5\", IF(COUNTIF(Général!G106:G110,$G$1)=1,\"Boat 6\", IF(COUNTIF(Général!H106:H110,$G$1)=1,\"Boat 7\",IF(COUNTIF(Général!I106:I110,$G$1)=1,\"Boat 8\",IF(COUNTIF(Général!J106:J110,$G$1)=1,\"Boat 9\",\"Boat 10\")))))))))","v":"Boat 4"},{"$f":"IF(COUNTIF(Général!B114:B118,$G$1)=1,\"Boat 1\",IF(COUNTIF(Général!C114:C118,$G$1)=1,\"Boat 2\",IF(COUNTIF(Général!C114:D118,$G$1)=1,\"Boat 3\", IF(COUNTIF(Général!C114:E118,$G$1)=1,\"Boat 4\", IF(COUNTIF(Général!F114:F118,$G$1)=1,\"Boat 5\", IF(COUNTIF(Général!G114:G118,$G$1)=1,\"Boat 6\", IF(COUNTIF(Général!H114:H118,$G$1)=1,\"Boat 7\",IF(COUNTIF(Général!I114:I118,$G$1)=1,\"Boat 8\",IF(COUNTIF(Général!J114:J118,$G$1)=1,\"Boat 9\",\"Boat 10\")))))))))","v":"Boat 4"},{"$f":"IF(COUNTIF(Général!B122:B126,$G$1)=1,\"Boat 1\",IF(COUNTIF(Général!C122:C126,$G$1)=1,\"Boat 2\",IF(COUNTIF(Général!D122:D126,$G$1)=1,\"Boat 3\", IF(COUNTIF(Général!E122:E126,$G$1)=1,\"Boat 4\", IF(COUNTIF(Général!F122:F126,$G$1)=1,\"Boat 5\", IF(COUNTIF(Général!G122:G126,$G$1)=1,\"Boat 6\", IF(COUNTIF(Général!H122:H126,$G$1)=1,\"Boat 7\",IF(COUNTIF(Général!I122:I126,$G$1)=1,\"Boat 8\",IF(COUNTIF(Général!J122:J126,$G$1)=1,\"Boat 9\",\"Boat 10\")))))))))","v":"Boat 1"},{"$f":"IF(COUNTIF(Général!B130:B134,$G$1)=1,\"Boat 1\",IF(COUNTIF(Général!C130:C134,$G$1)=1,\"Boat 2\",IF(COUNTIF(Général!D130:D134,$G$1)=1,\"Boat 3\", IF(COUNTIF(Général!E130:E134,$G$1)=1,\"Boat 4\", IF(COUNTIF(Général!F130:F134,$G$1)=1,\"Boat 5\", IF(COUNTIF(Général!G130:G134,$G$1)=1,\"Boat 6\", IF(COUNTIF(Général!H130:H134,$G$1)=1,\"Boat 7\",IF(COUNTIF(Général!I130:I134,$G$1)=1,\"Boat 8\",IF(COUNTIF(Général!J130:J134,$G$1)=1,\"Boat 9\",\"Boat 10\")))))))))","v":"Boat 1"},{"$f":"IF(COUNTIF(Général!B138:B142,$G$1)=1,\"Boat 1\",IF(COUNTIF(Général!C138:C142,$G$1)=1,\"Boat 2\",IF(COUNTIF(Général!D138:D142,$G$1)=1,\"Boat 3\", IF(COUNTIF(Général!E138:E142,$G$1)=1,\"Boat 4\", IF(COUNTIF(Général!F138:F142,$G$1)=1,\"Boat 5\", IF(COUNTIF(Général!G138:G142,$G$1)=1,\"Boat 6\", IF(COUNTIF(Général!H138:H142,$G$1)=1,\"Boat 7\",IF(COUNTIF(Général!I138:I142,$G$1)=1,\"Boat 8\",IF(COUNTIF(Général!J138:J142,$G$1)=1,\"Boat 9\",\"Boat 10\")))))))))","v":"Boat 5"},{"$f":"IF(COUNTIF(Général!B146:B150,$G$1)=1,\"Boat 1\",IF(COUNTIF(Général!C146:C150,$G$1)=1,\"Boat 2\",IF(COUNTIF(Général!D146:D150,$G$1)=1,\"Boat 3\", IF(COUNTIF(Général!E146:E150,$G$1)=1,\"Boat 4\", IF(COUNTIF(Général!F146:F150,$G$1)=1,\"Boat 5\", IF(COUNTIF(Général!G146:G150,$G$1)=1,\"Boat 6\", IF(COUNTIF(Général!H146:H150,$G$1)=1,\"Boat 7\",IF(COUNTIF(Général!I146:I150,$G$1)=1,\"Boat 8\",IF(COUNTIF(Général!J146:J150,$G$1)=1,\"Boat 9\",\"Boat 10\")))))))))","v":"Boat 1"},{"$f":"IF(COUNTIF(Général!B154:B157,$G$1)=1,\"Boat 1\",IF(COUNTIF(Général!C154:C157,$G$1)=1,\"Boat 2\",IF(COUNTIF(Général!D154:D157,$G$1)=1,\"Boat 3\", IF(COUNTIF(Général!E154:E157,$G$1)=1,\"Boat 4\", IF(COUNTIF(Général!F154:F157,$G$1)=1,\"Boat 5\", IF(COUNTIF(Général!G154:G157,$G$1)=1,\"Boat 6\", IF(COUNTIF(Général!H154:H157,$G$1)=1,\"Boat 7\",IF(COUNTIF(Général!I154:I157,$G$1)=1,\"Boat 8\",IF(COUNTIF(Général!J154:J157,$G$1)=1,\"Boat 9\",\"Boat 10\")))))))))","v":"Boat 5"},{"$f":"IF(COUNTIF(Général!B160:B163,$G$1)=1,\"Boat 1\",IF(COUNTIF(Général!C160:C163,$G$1)=1,\"Boat 2\",IF(COUNTIF(Général!D160:D163,$G$1)=1,\"Boat 3\", IF(COUNTIF(Général!E160:E163,$G$1)=1,\"Boat 4\", IF(COUNTIF(Général!F160:F163,$G$1)=1,\"Boat 5\", IF(COUNTIF(Général!G160:G163,$G$1)=1,\"Boat 6\", IF(COUNTIF(Général!H160:H163,$G$1)=1,\"Boat 7\",IF(COUNTIF(Général!I160:I163,$G$1)=1,\"Boat 8\",IF(COUNTIF(Général!J160:J163,$G$1)=1,\"Boat 9\",\"Boat 10\")))))))))","v":"Boat 5"},{"$f":"IF(COUNTIF(Général!B166:B169,$G$1)=1,\"Boat 1\",IF(COUNTIF(Général!C166:C169,$G$1)=1,\"Boat 2\",IF(COUNTIF(Général!D166:D169,$G$1)=1,\"Boat 3\", IF(COUNTIF(Général!E166:E169,$G$1)=1,\"Boat 4\", IF(COUNTIF(Général!F166:F169,$G$1)=1,\"Boat 5\", IF(COUNTIF(Général!G166:G169,$G$1)=1,\"Boat 6\", IF(COUNTIF(Général!H166:H169,$G$1)=1,\"Boat 7\",IF(COUNTIF(Général!I166:I169,$G$1)=1,\"Boat 8\",IF(COUNTIF(Général!J166:J169,$G$1)=1,\"Boat 9\",\"Boat 10\")))))))))","v":"Boat 5"},null,{"$f":"Général!B8","v":"Equipage 6"},3]
[null,null,null,null,null,null,null,null,null,null,null,null,null,null,null,null,null,null,null,null,null,{"$f":"Général!B9","v":"Equipage 7"},4]
["1er Equipage",null,{"$f":"IF($C$5=\"Course 1\",Général!B34,IF($C$5=\"Course 2\",Général!B36,IF($C$5=\"Course 3\",Général!#REF!,Général!B38)))","v":"Equipage 8"},{"$f":"IF($D$5=\"Course 1\",Général!B42,IF($D$5=\"Course 2\",Général!B44,IF($D$5=\"Course 3\",Général!#REF!,Général!B46)))","v":"Equipage 8"},{"$f":"IF($E$5=\"Course 1\",Général!B50,IF($E$5=\"Course 2\",Général!B52,IF($E$5=\"Course 3\",Général!#REF!,Général!B54)))","v":"Equipage 5"},{"$f":"IF($F$5=\"Course 1\",Général!B$58,IF($F$5=\"Course 2\",Général!B$60,IF($F$5=\"Course 3\",Général!#REF!,Général!B$62)))","v":"Equipage 2"},{"$f":"IF($G$5=\"Course 1\",Général!B$66,IF($G$5=\"Course 2\",Général!B$68,IF($G$5=\"Course 3\",Général!#REF!,Général!B$70)))","v":"Equipage 4"},{"$f":"IF($H$5=\"Course 1\",Général!B$74,IF($H$5=\"Course 2\",Général!B$76,IF($H$5=\"Course 3\",Général!#REF!,Général!B$78)))","v":"Equipage 4"},{"$f":"IF($I$5=\"Course 1\",Général!B$82,IF($I$5=\"Course 2\",Général!B$84,IF($I$5=\"Course 3\",Général!#REF!,Général!B$86)))","v":"Equipage 4"},{"$f":"IF($J$5=\"Course 1\",Général!B$90,IF($J$5=\"Course 2\",Général!B$92,IF($J$5=\"Course 3\",Général!#REF!,Général!B$94)))","v":"Equipage 10"},{"$f":"IF($K$5=\"Course 1\",Général!B$98,IF($K$5=\"Course 2\",Général!B$100,IF($K$5=\"Course 3\",Général!#REF!,Général!B$102)))","v":"Equipage 3"},{"$f":"IF($L$5=\"Course 1\",Général!B$106,IF($L$5=\"Course 2\",Général!B$108,IF($L$5=\"Course 3\",Général!#REF!,Général!B$110)))","v":"Equipage 10"},{"$f":"IF($M$5=\"Course 1\",Général!B$114,IF($M$5=\"Course 2\",Général!B$116,IF($M$5=\"Course 3\",Général!#REF!,Général!B$118)))","v":"Equipage 5"},{"$f":"IF($N$5=\"Course 1\",Général!B$122,IF($N$5=\"Course 2\",Général!B$124,IF($N$5=\"Course 3\",Général!#REF!,Général!B$126)))","v":"Equipage 8"},{"$f":"IF($O$5=\"Course 1\",Général!B$130,IF($O$5=\"Course 2\",Général!B$132,IF($O$5=\"Course 3\",Général!#REF!,Général!B$134)))","v":"Equipage 8"},{"$f":"IF($P$5=\"Course 1\",Général!B$138,IF($P$5=\"Course 2\",Général!B$140,IF($P$5=\"Course 3\",Général!#REF!,Général!B$142)))","v":"Equipage 9"},{"$f":"IF($Q$5=\"Course 1\",Général!B$146,IF($Q$5=\"Course 2\",Général!B$148,IF($Q$5=\"Course 3\",Général!#REF!,Général!B$150)))","v":"Equipage 8"},{"$f":"IF($R$5=\"Course 1\",Général!B$154,IF($R$5=\"Course 2\",Général!B$156,IF($R$5=\"Course 3\",Général!B$158,Général!B$160)))","v":"Equipage 3"},null,null,null,{"$f":"Général!B10","v":"Equipage 8"},16]
["2nd Equipage",null,{"$f":"IF($C$5=\"Course 1\",Général!C34,IF($C$5=\"Course 2\",Général!C36,IF($C$5=\"Course 3\",Général!#REF!,Général!C38)))","v":"Equipage 5"},{"$f":"IF($D$5=\"Course 1\",Général!C42,IF($D$5=\"Course 2\",Général!C44,IF($D$5=\"Course 3\",Général!#REF!,Général!C46)))","v":"Equipage 4"},{"$f":"IF($E$5=\"Course 1\",Général!C50,IF($E$5=\"Course 2\",Général!C52,IF($E$5=\"Course 3\",Général!#REF!,Général!C54)))","v":"Equipage 8"},{"$f":"IF($F$5=\"Course 1\",Général!C$58,IF($F$5=\"Course 2\",Général!C$60,IF($F$5=\"Course 3\",Général!#REF!,Général!C$62)))","v":"Equipage 4"},{"$f":"IF($G$5=\"Course 1\",Général!C$66,IF($G$5=\"Course 2\",Général!C$68,IF($G$5=\"Course 3\",Général!#REF!,Général!C$70)))","v":"Equipage 10"},{"$f":"IF($H$5=\"Course 1\",Général!C$74,IF($H$5=\"Course 2\",Général!C$76,IF($H$5=\"Course 3\",Général!#REF!,Général!C$78)))","v":"Equipage 8"},{"$f":"IF($I$5=\"Course 1\",Général!C$82,IF($I$5=\"Course 2\",Général!C$84,IF($I$5=\"Course 3\",Général!#REF!,Général!C$86)))","v":"Equipage 8"},{"$f":"IF($J$5=\"Course 1\",Général!C$90,IF($J$5=\"Course 2\",Général!C$92,IF($J$5=\"Course 3\",Général!#REF!,Général!C$94)))","v":"Equipage 1"},{"$f":"IF($K$5=\"Course 1\",Général!C$98,IF($K$5=\"Course 2\",Général!C$100,IF($K$5=\"Course 3\",Général!#REF!,Général!C$102)))","v":"Equipage 8"},{"$f":"IF($L$5=\"Course 1\",Général!C$106,IF($L$5=\"Course 2\",Général!C$108,IF($L$5=\"Course 3\",Général!#REF!,Général!C$110)))","v":"Equipage 4"},{"$f":"IF($M$5=\"Course 1\",Général!C$114,IF($M$5=\"Course 2\",Général!C$116,IF($M$5=\"Course 3\",Général!#REF!,Général!C$118)))","v":"Equipage 2"},{"$f":"IF($N$5=\"Course 1\",Général!C$122,IF($N$5=\"Course 2\",Général!C$124,IF($N$5=\"Course 3\",Général!#REF!,Général!C$126)))","v":"Equipage 5"},{"$f":"IF($O$5=\"Course 1\",Général!C$130,IF($O$5=\"Course 2\",Général!C$132,IF($O$5=\"Course 3\",Général!#REF!,Général!C$134)))","v":"Equipage 3"},{"$f":"IF($P$5=\"Course 1\",Général!C$138,IF($P$5=\"Course 2\",Général!C$140,IF($P$5=\"Course 3\",Général!#REF!,Général!C$142)))","v":"Equipage 2"},{"$f":"IF($Q$5=\"Course 1\",Général!C$146,IF($Q$5=\"Course 2\",Général!C$148,IF($Q$5=\"Course 3\",Général!#REF!,Général!C$150)))","v":"Equipage 1"},{"$f":"IF($R$5=\"Course 1\",Général!C$154,IF($R$5=\"Course 2\",Général!C$156,IF($R$5=\"Course 3\",Général!C$158,Général!C$160)))","v":"Equipage 9"},null,null,null,{"$f":"Général!B11","v":"Equipage 9"},8]
["3ème Equipage",null,{"$f":"IF($C$5=\"Course 1\",Général!D34,IF($C$5=\"Course 2\",Général!D36,IF($C$5=\"Course 3\",Général!#REF!,Général!D38)))","v":"Equipage 9"},{"$f":"IF($D$5=\"Course 1\",Général!D42,IF($D$5=\"Course 2\",Général!D44,IF($D$5=\"Course 3\",Général!#REF!,Général!D46)))","v":"Equipage 9"},{"$f":"IF($E$5=\"Course 1\",Général!D50,IF($E$5=\"Course 2\",Général!D52,IF($E$5=\"Course 3\",Général!#REF!,Général!D54)))","v":"Equipage 4"},{"$f":"IF($F$5=\"Course 1\",Général!D$58,IF($F$5=\"Course 2\",Général!D$60,IF($F$5=\"Course 3\",Général!#REF!,Général!D$62)))","v":"Equipage 8"},{"$f":"IF($G$5=\"Course 1\",Général!D$66,IF($G$5=\"Course 2\",Général!D$68,IF($G$5=\"Course 3\",Général!#REF!,Général!D$70)))","v":"Equipage 8"},{"$f":"IF($H$5=\"Course 1\",Général!D$74,IF($H$5=\"Course 2\",Général!D$76,IF($H$5=\"Course 3\",Général!#REF!,Général!D$78)))","v":"Equipage 9"},{"$f":"IF($I$5=\"Course 1\",Général!D$82,IF($I$5=\"Course 2\",Général!D$84,IF($I$5=\"Course 3\",Général!#REF!,Général!D$86)))","v":"Equipage 7"},{"$f":"IF($J$5=\"Course 1\",Général!D$90,IF($J$5=\"Course 2\",Général!D$92,IF($J$5=\"Course 3\",Général!#REF!,Général!D$94)))","v":"Equipage 3"},{"$f":"IF($K$5=\"Course 1\",Général!D$98,IF($K$5=\"Course 2\",Général!D$100,IF($K$5=\"Course 3\",Général!#REF!,Général!D$102)))","v":"Equipage 5"},{"$f":"IF($L$5=\"Course 1\",Général!D$106,IF($L$5=\"Course 2\",Général!D$108,IF($L$5=\"Course 3\",Général!#REF!,Général!D$110)))","v":"Equipage 1"},{"$f":"IF($M$5=\"Course 1\",Général!D$114,IF($M$5=\"Course 2\",Général!D$116,IF($M$5=\"Course 3\",Général!#REF!,Général!D$118)))","v":"Equipage 6"},{"$f":"IF($N$5=\"Course 1\",Général!D$122,IF($N$5=\"Course 2\",Général!D$124,IF($N$5=\"Course 3\",Général!#REF!,Général!D$126)))","v":"Equipage 7"},{"$f":"IF($O$5=\"Course 1\",Général!D$130,IF($O$5=\"Course 2\",Général!D$132,IF($O$5=\"Course 3\",Général!#REF!,Général!D$134)))","v":"Equipage 2"},{"$f":"IF($P$5=\"Course 1\",Général!D$138,IF($P$5=\"Course 2\",Général!D$140,IF($P$5=\"Course 3\",Général!#REF!,Général!D$142)))","v":"Equipage 6"},{"$f":"IF($Q$5=\"Course 1\",Général!D$146,IF($Q$5=\"Course 2\",Général!D$148,IF($Q$5=\"Course 3\",Général!#REF!,Général!D$150)))","v":"Equipage 2"},{"$f":"IF($R$5=\"Course 1\",Général!D$154,IF($R$5=\"Course 2\",Général!D$156,IF($R$5=\"Course 3\",Général!D$158,Général!D$160)))","v":"Equipage 2"},null,null,null,{"$f":"Général!B12","v":"Equipage 10"},8]
["4ème Equipage",null,{"$f":"IF($C$5=\"Course 1\",Général!E34,IF($C$5=\"Course 2\",Général!E36,IF($C$5=\"Course 3\",Général!#REF!,Général!E38)))","v":"Equipage 3"},{"$f":"IF($D$5=\"Course 1\",Général!E42,IF($D$5=\"Course 2\",Général!E44,IF($D$5=\"Course 3\",Général!#REF!,Général!E46)))","v":"Equipage 10"},{"$f":"IF($E$5=\"Course 1\",Général!E50,IF($E$5=\"Course 2\",Général!E52,IF($E$5=\"Course 3\",Général!#REF!,Général!E54)))","v":"Equipage 10"},{"$f":"IF($F$5=\"Course 1\",Général!E$58,IF($F$5=\"Course 2\",Général!E$60,IF($F$5=\"Course 3\",Général!#REF!,Général!E$62)))","v":"Equipage 5"},{"$f":"IF($G$5=\"Course 1\",Général!E$66,IF($G$5=\"Course 2\",Général!E$68,IF($G$5=\"Course 3\",Général!#REF!,Général!E$70)))","v":"Equipage 5"},{"$f":"IF($H$5=\"Course 1\",Général!E$74,IF($H$5=\"Course 2\",Général!E$76,IF($H$5=\"Course 3\",Général!#REF!,Général!E$78)))","v":"Equipage 10"},{"$f":"IF($I$5=\"Course 1\",Général!E$82,IF($I$5=\"Course 2\",Général!E$84,IF($I$5=\"Course 3\",Général!#REF!,Général!E$86)))","v":"Equipage 10"},{"$f":"IF($J$5=\"Course 1\",Général!E$90,IF($J$5=\"Course 2\",Général!E$92,IF($J$5=\"Course 3\",Général!#REF!,Général!E$94)))","v":"Equipage 2"},{"$f":"IF($K$5=\"Course 1\",Général!E$98,IF($K$5=\"Course 2\",Général!E$100,IF($K$5=\"Course 3\",Général!#REF!,Général!E$102)))","v":"Equipage 7"},{"$f":"IF($L$5=\"Course 1\",Général!E$106,IF($L$5=\"Course 2\",Général!E$108,IF($L$5=\"Course 3\",Général!#REF!,Général!E$110)))","v":"Equipage 8"},{"$f":"IF($M$5=\"Course 1\",Général!E$114,IF($M$5=\"Course 2\",Général!E$116,IF($M$5=\"Course 3\",Général!#REF!,Général!E$118)))","v":"Equipage 8"},{"$f":"IF($N$5=\"Course 1\",Général!E$122,IF($N$5=\"Course 2\",Général!E$124,IF($N$5=\"Course 3\",Général!#REF!,Général!E$126)))","v":"Equipage 1"},{"$f":"IF($O$5=\"Course 1\",Général!E$130,IF($O$5=\"Course 2\",Général!E$132,IF($O$5=\"Course 3\",Général!#REF!,Général!E$134)))","v":"Equipage 1"},{"$f":"IF($P$5=\"Course 1\",Général!E$138,IF($P$5=\"Course 2\",Général!E$140,IF($P$5=\"Course 3\",Général!#REF!,Général!E$142)))","v":"Equipage 5"},{"$f":"IF($Q$5=\"Course 1\",Général!E$146,IF($Q$5=\"Course 2\",Général!E$148,IF($Q$5=\"Course 3\",Général!#REF!,Général!E$150)))","v":"Equipage 4"},{"$f":"IF($R$5=\"Course 1\",Général!E$154,IF($R$5=\"Course 2\",Général!E$156,IF($R$5=\"Course 3\",Général!E$158,Général!E$160)))","v":"Equipage 5"}]
["5ème Equipage",null,{"$f":"IF($C$5=\"Course 1\",Général!F34,IF($C$5=\"Course 2\",Général!F36,IF($C$5=\"Course 3\",Général!#REF!,Général!F38)))","v":"Equipage 2"},{"$f":"IF($D$5=\"Course 1\",Général!F42,IF($D$5=\"Course 2\",Général!F44,IF($D$5=\"Course 3\",Général!#REF!,Général!F46)))","v":"Equipage 6"},{"$f":"IF($E$5=\"Course 1\",Général!F50,IF($E$5=\"Course 2\",Général!F52,IF($E$5=\"Course 3\",Général!#REF!,Général!F54)))","v":"Equipage 7"},{"$f":"IF($F$5=\"Course 1\",Général!F$58,IF($F$5=\"Course 2\",Général!F$60,IF($F$5=\"Course 3\",Général!#REF!,Général!F$62)))","v":"Equipage 1"},{"$f":"IF($G$5=\"Course 1\",Général!F$66,IF($G$5=\"Course 2\",Général!F$68,IF($G$5=\"Course 3\",Général!#REF!,Général!F$70)))","v":"Equipage 1"},{"$f":"IF($H$5=\"Course 1\",Général!F$74,IF($H$5=\"Course 2\",Général!F$76,IF($H$5=\"Course 3\",Général!#REF!,Général!F$78)))","v":"Equipage 5"},{"$f":"IF($I$5=\"Course 1\",Général!F$82,IF($I$5=\"Course 2\",Général!F$84,IF($I$5=\"Course 3\",Général!#REF!,Général!F$86)))","v":"Equipage 5"},{"$f":"IF($J$5=\"Course 1\",Général!F$90,IF($J$5=\"Course 2\",Général!F$92,IF($J$5=\"Course 3\",Général!#REF!,Général!F$94)))","v":"Equipage 8"},{"$f":"IF($K$5=\"Course 1\",Général!F$98,IF($K$5=\"Course 2\",Général!F$100,IF($K$5=\"Course 3\",Général!#REF!,Général!F$102)))","v":"Equipage 10"},{"$f":"IF($L$5=\"Course 1\",Général!F$106,IF($L$5=\"Course 2\",Général!$F108,IF($L$5=\"Course 3\",Général!#REF!,Général!F$110)))","v":"Equipage 9"},{"$f":"IF($M$5=\"Course 1\",Général!F$114,IF($M$5=\"Course 2\",Général!F$116,IF($M$5=\"Course 3\",Général!#REF!,Général!F$118)))","v":"Equipage 9"},{"$f":"IF($N$5=\"Course 1\",Général!F$122,IF($N$5=\"Course 2\",Général!F$124,IF($N$5=\"Course 3\",Général!#REF!,Général!F$126)))","v":"Equipage 4"},{"$f":"IF($O$5=\"Course 1\",Général!F$130,IF($O$5=\"Course 2\",Général!F$132,IF($O$5=\"Course 3\",Général!#REF!,Général!F$134)))","v":"Equipage 9"},{"$f":"IF($P$5=\"Course 1\",Général!F$138,IF($P$5=\"Course 2\",Général!F$140,IF($P$5=\"Course 3\",Général!#REF!,Général!F$142)))","v":"Equipage 8"},{"$f":"IF($Q$5=\"Course 1\",Général!F$146,IF($Q$5=\"Course 2\",Général!F$148,IF($Q$5=\"Course 3\",Général!#REF!,Général!F$150)))","v":"Equipage 5"},{"$f":"IF($R$5=\"Course 1\",Général!F$154,IF($R$5=\"Course 2\",Général!F$156,IF($R$5=\"Course 3\",Général!F$158,Général!F$160)))","v":"Equipage 8"}]
["7ème Equipage",null,{"$f":"IF($C$5=\"Course 1\",Général!H34,IF($C$5=\"Course 2\",Général!H36,IF($C$5=\"Course 3\",Général!#REF!,Général!H38)))","v":0},{"$f":"IF($D$5=\"Course 1\",Général!H42,IF($D$5=\"Course 2\",Général!H44,IF($D$5=\"Course 3\",Général!#REF!,Général!H46)))","v":0},{"$f":"IF($E$5=\"Course 1\",Général!H50,IF($E$5=\"Course 2\",Général!H52,IF($E$5=\"Course 3\",Général!#REF!,Général!H54)))","v":0},{"$f":"IF($F$5=\"Course 1\",Général!H$58,IF($F$5=\"Course 2\",Général!H$60,IF($F$5=\"Course 3\",Général!#REF!,Général!H$62)))","v":0},{"$f":"IF($G$5=\"Course 1\",Général!H$66,IF($G$5=\"Course 2\",Général!H$68,IF($G$5=\"Course 3\",Général!#REF!,Général!H$70)))","v":0},{"$f":"IF($H$5=\"Course 1\",Général!H$74,IF($H$5=\"Course 2\",Général!H$76,IF($H$5=\"Course 3\",Général!#REF!,Général!H$78)))","v":0},{"$f":"IF($I$5=\"Course 1\",Général!H$82,IF($I$5=\"Course 2\",Général!H$84,IF($I$5=\"Course 3\",Général!#REF!,Général!H$86)))","v":0},{"$f":"IF($J$5=\"Course 1\",Général!H$90,IF($J$5=\"Course 2\",Général!H$92,IF($J$5=\"Course 3\",Général!#REF!,Général!H$94)))","v":0},{"$f":"IF($K$5=\"Course 1\",Général!H$98,IF($K$5=\"Course 2\",Général!H$100,IF($K$5=\"Course 3\",Général!#REF!,Général!H$102)))","v":0},{"$f":"IF($L$5=\"Course 1\",Général!H$106,IF($L$5=\"Course 2\",Général!H$108,IF($L$5=\"Course 3\",Général!#REF!,Général!H$110)))","v":0},{"$f":"IF($M$5=\"Course 1\",Général!H$114,IF($M$5=\"Course 2\",Général!H$116,IF($M$5=\"Course 3\",Général!#REF!,Général!H$118)))","v":0},{"$f":"IF($N$5=\"Course 1\",Général!H$122,IF($N$5=\"Course 2\",Général!H$124,IF($N$5=\"Course 3\",Général!#REF!,Général!H$126)))","v":0},{"$f":"IF($O$5=\"Course 1\",Général!H$130,IF($O$5=\"Course 2\",Général!H$132,IF($O$5=\"Course 3\",Général!#REF!,Général!H$134)))","v":0},{"$f":"IF($P$5=\"Course 1\",Général!H$138,IF($P$5=\"Course 2\",Général!H$140,IF($P$5=\"Course 3\",Général!#REF!,Général!H$142)))","v":0},{"$f":"IF($Q$5=\"Course 1\",Général!H$146,IF($Q$5=\"Course 2\",Général!H$148,IF($Q$5=\"Course 3\",Général!#REF!,Général!H$150)))","v":0},{"$f":"IF($R$5=\"Course 1\",Général!H$154,IF($R$5=\"Course 2\",Général!H$156,IF($R$5=\"Course 3\",Général!H$158,Général!H$160)))","v":0},null,null,null,{"$f":"Général!B14","v":"Equipage 14"},{"$f":"COUNTIF($C$8:$R$16,V13)","v":0}]
["8ème Equipage",null,{"$f":"IF($C$5=\"Course 1\",Général!I34,IF($C$5=\"Course 2\",Général!I36,IF($C$5=\"Course 3\",Général!#REF!,Général!I38)))","v":0},{"$f":"IF($D$5=\"Course 1\",Général!I42,IF($D$5=\"Course 2\",Général!I44,IF($D$5=\"Course 3\",Général!#REF!,Général!I46)))","v":0},{"$f":"IF($E$5=\"Course 1\",Général!I50,IF($E$5=\"Course 2\",Général!I52,IF($E$5=\"Course 3\",Général!#REF!,Général!I54)))","v":0},{"$f":"IF($F$5=\"Course 1\",Général!I$58,IF($F$5=\"Course 2\",Général!I$60,IF($F$5=\"Course 3\",Général!#REF!,Général!I$62)))","v":0},{"$f":"IF($G$5=\"Course 1\",Général!I$66,IF($G$5=\"Course 2\",Général!I$68,IF($G$5=\"Course 3\",Général!#REF!,Général!I$70)))","v":0},{"$f":"IF($H$5=\"Course 1\",Général!I$74,IF($H$5=\"Course 2\",Général!I$76,IF($H$5=\"Course 3\",Général!#REF!,Général!I$78)))","v":0},{"$f":"IF($I$5=\"Course 1\",Général!I$82,IF($I$5=\"Course 2\",Général!I$84,IF($I$5=\"Course 3\",Général!#REF!,Général!I$86)))","v":0},{"$f":"IF($J$5=\"Course 1\",Général!I$90,IF($J$5=\"Course 2\",Général!I$92,IF($J$5=\"Course 3\",Général!#REF!,Général!I$94)))","v":0},{"$f":"IF($K$5=\"Course 1\",Général!I$98,IF($K$5=\"Course 2\",Général!I$100,IF($K$5=\"Course 3\",Général!#REF!,Général!I$102)))","v":0},{"$f":"IF($L$5=\"Course 1\",Général!I$106,IF($L$5=\"Course 2\",Général!I$108,IF($L$5=\"Course 3\",Général!#REF!,Général!I$110)))","v":0},{"$f":"IF($M$5=\"Course 1\",Général!I$114,IF($M$5=\"Course 2\",Général!I$116,IF($M$5=\"Course 3\",Général!#REF!,Général!I$118)))","v":0},{"$f":"IF($N$5=\"Course 1\",Général!I$122,IF($N$5=\"Course 2\",Général!I$124,IF($N$5=\"Course 3\",Général!#REF!,Général!I$126)))","v":0},{"$f":"IF($O$5=\"Course 1\",Général!I$130,IF($O$5=\"Course 2\",Général!I$132,IF($O$5=\"Course 3\",Général!#REF!,Général!I$134)))","v":0},{"$f":"IF($P$5=\"Course 1\",Général!I$138,IF($P$5=\"Course 2\",Général!I$140,IF($P$5=\"Course 3\",Général!#REF!,Général!I$142)))","v":0},{"$f":"IF($Q$5=\"Course 1\",Général!I$146,IF($Q$5=\"Course 2\",Général!I$148,IF($Q$5=\"Course 3\",Général!#REF!,Général!I$150)))","v":0},{"$f":"IF($R$5=\"Course 1\",Général!I$154,IF($R$5=\"Course 2\",Général!I$156,IF($R$5=\"Course 3\",Général!I$158,Général!I$160)))","v":0},null,null,null,{"$f":"Général!B15","v":"Equipage 15"},0]
["9ème Equipage",null,{"$f":"IF($C$5=\"Course 1\",Général!J34,IF($C$5=\"Course 2\",Général!J36,IF($C$5=\"Course 3\",Général!#REF!,Général!J38)))","v":0},{"$f":"IF($D$5=\"Course 1\",Général!J42,IF($D$5=\"Course 2\",Général!J44,IF($D$5=\"Course 3\",Général!#REF!,Général!J46)))","v":0},{"$f":"IF($E$5=\"Course 1\",Général!J50,IF($E$5=\"Course 2\",Général!J52,IF($E$5=\"Course 3\",Général!#REF!,Général!J54)))","v":0},{"$f":"IF($F$5=\"Course 1\",Général!J$58,IF($F$5=\"Course 2\",Général!J$60,IF($F$5=\"Course 3\",Général!#REF!,Général!J$62)))","v":0},{"$f":"IF($G$5=\"Course 1\",Général!J$66,IF($G$5=\"Course 2\",Général!J$68,IF($G$5=\"Course 3\",Général!#REF!,Général!J$70)))","v":0},{"$f":"IF($H$5=\"Course 1\",Général!J$74,IF($H$5=\"Course 2\",Général!J$76,IF($H$5=\"Course 3\",Général!#REF!,Général!J$78)))","v":0},{"$f":"IF($I$5=\"Course 1\",Général!J$82,IF($I$5=\"Course 2\",Général!J$84,IF($I$5=\"Course 3\",Général!#REF!,Général!J$86)))","v":0},{"$f":"IF($J$5=\"Course 1\",Général!J$90,IF($J$5=\"Course 2\",Général!J$92,IF($J$5=\"Course 3\",Général!#REF!,Général!J$94)))","v":0},{"$f":"IF($K$5=\"Course 1\",Général!J$98,IF($K$5=\"Course 2\",Général!J$100,IF($K$5=\"Course 3\",Général!#REF!,Général!J$102)))","v":0},{"$f":"IF($L$5=\"Course 1\",Général!J$106,IF($L$5=\"Course 2\",Général!J$108,IF($L$5=\"Course 3\",Général!#REF!,Général!J$110)))","v":0},{"$f":"IF($M$5=\"Course 1\",Général!J$114,IF($M$5=\"Course 2\",Général!J$116,IF($M$5=\"Course 3\",Général!#REF!,Général!J$118)))","v":0},{"$f":"IF($N$5=\"Course 1\",Général!J$122,IF($N$5=\"Course 2\",Général!J$124,IF($N$5=\"Course 3\",Général!#REF!,Général!J$126)))","v":0},{"$f":"IF($O$5=\"Course 1\",Général!J$130,IF($O$5=\"Course 2\",Général!J$132,IF($O$5=\"Course 3\",Général!#REF!,Général!J$134)))","v":0},{"$f":"IF($P$5=\"Course 1\",Général!J$138,IF($P$5=\"Course 2\",Général!J$140,IF($P$5=\"Course 3\",Général!#REF!,Général!J$142)))","v":0},{"$f":"IF($Q$5=\"Course 1\",Général!J$146,IF($Q$5=\"Course 2\",Général!J$148,IF($Q$5=\"Course 3\",Général!#REF!,Général!J$150)))","v":0},{"$f":"IF($R$5=\"Course 1\",Général!J$154,IF($R$5=\"Course 2\",Général!J$156,IF($R$5=\"Course 3\",Général!J$158,Général!J$160)))","v":0},null,null,null,{"$f":"Général!B16","v":"Equipage 16"},0]
["10ème Equipage",null,{"$f":"IF($C$5=\"Course 1\",Général!K34,IF($C$5=\"Course 2\",Général!K36,IF($C$5=\"Course 3\",Général!#REF!,Général!K38)))","v":0},{"$f":"IF($D$5=\"Course 1\",Général!K42,IF($D$5=\"Course 2\",Général!K44,IF($D$5=\"Course 3\",Général!#REF!,Général!K46)))","v":0},{"$f":"IF($E$5=\"Course 1\",Général!K50,IF($E$5=\"Course 2\",Général!K52,IF($E$5=\"Course 3\",Général!#REF!,Général!K54)))","v":0},{"$f":"IF($F$5=\"Course 1\",Général!K$58,IF($F$5=\"Course 2\",Général!K$60,IF($F$5=\"Course 3\",Général!#REF!,Général!K$62)))","v":0},{"$f":"IF($G$5=\"Course 1\",Général!K$66,IF($G$5=\"Course 2\",Général!K$68,IF($G$5=\"Course 3\",Général!#REF!,Général!K$70)))","v":0},{"$f":"IF($H$5=\"Course 1\",Général!K$74,IF($H$5=\"Course 2\",Général!K$76,IF($H$5=\"Course 3\",Général!#REF!,Général!K$78)))","v":0},{"$f":"IF($I$5=\"Course 1\",Général!K$82,IF($I$5=\"Course 2\",Général!K$84,IF($I$5=\"Course 3\",Général!#REF!,Général!K$86)))","v":0},{"$f":"IF($J$5=\"Course 1\",Général!K$90,IF($J$5=\"Course 2\",Général!K$92,IF($J$5=\"Course 3\",Général!#REF!,Général!K$94)))","v":0},{"$f":"IF($K$5=\"Course 1\",Général!K$98,IF($K$5=\"Course 2\",Général!K$100,IF($K$5=\"Course 3\",Général!#REF!,Général!K$102)))","v":0},{"$f":"IF($L$5=\"Course 1\",Général!K$106,IF($L$5=\"Course 2\",Général!K$108,IF($L$5=\"Course 3\",Général!#REF!,Général!K$110)))","v":0},{"$f":"IF($M$5=\"Course 1\",Général!K$114,IF($M$5=\"Course 2\",Général!K$116,IF($M$5=\"Course 3\",Général!#REF!,Général!K$118)))","v":0},{"$f":"IF($N$5=\"Course 1\",Général!K$122,IF($N$5=\"Course 2\",Général!K$124,IF($N$5=\"Course 3\",Général!#REF!,Général!K$126)))","v":0},{"$f":"IF($O$5=\"Course 1\",Général!K$130,IF($O$5=\"Course 2\",Général!K$132,IF($O$5=\"Course 3\",Général!#REF!,Général!K$134)))","v":0},{"$f":"IF($P$5=\"Course 1\",Général!K$138,IF($P$5=\"Course 2\",Général!K$140,IF($P$5=\"Course 3\",Général!#REF!,Général!K$142)))","v":0},{"$f":"IF($Q$5=\"Course 1\",Général!K$146,IF($Q$5=\"Course 2\",Général!K$148,IF($Q$5=\"Course 3\",Général!#REF!,Général!K$150)))","v":0},{"$f":"IF($R$5=\"Course 1\",Général!K$154,IF($R$5=\"Course 2\",Général!K$156,IF($R$5=\"Course 3\",Général!K$158,Général!K$160)))","v":0},null,null,null,{"$f":"Général!B17","v":"Equipage 17"},0]
[null,null,null,null,null,null,null,null,null,null,null,null,null,null,null,null,null,null,null,null,null,{"$f":"Général!B18","v":"Equipage 18"},0]
[null,null,null,null,null,null,null,null,null,null,null,null,null,null,null,null,null,null,null,null,null,{"$f":"Général!B19","v":"Equipage 19"},0]
[null,null,null,null,null,null,null,null,null,null,null,null,null,null,null,null,null,null,null,null,null,{"$f":"Général!B20","v":"Equipage 20"},0]
[null,null,null,null,null,null,null,null,null,null,null,null,null,null,null,null,null,null,null,null,null,{"$f":"Général!B21","v":"Equipage 21"},0]
[null,null,null,null,null,null,null,null,null,null,null,null,null,null,null,null,null,null,null,null,null,{"$f":"Général!B22","v":"Equipage 22"},0]
[null,null,null,null,null,null,null,null,null,null,null,null,null,null,null,null,null,null,null,null,null,{"$f":"Général!B23","v":"Equipage 23"},0]
[null,null,null,null,null,null,null,null,null,null,null,null,null,null,null,null,null,null,null,null,null,{"$f":"Général!B24","v":"Equipage 24"},0]
[null,null,null,null,null,null,null,null,null,null,null,null,null,null,null,null,null,null,null,null,null,{"$f":"Général!B25","v":"Equipage 25"},0]
[null,null,null,null,null,null,null,null,null,null,null,null,null,null,null,null,null,null,null,null,null,{"$f":"Général!B26","v":"Equipage 26"},0]
[null,null,null,null,null,null,null,null,null,null,null,null,null,null,null,null,null,null,null,null,null,{"$f":"Général!B27","v":"Equipage 27"},0]
[null,null,null,null,null,null,null,null,null,null,null,null,null,null,null,null,null,null,null,null,null,{"$f":"Général!B28","v":"Equipage 28"},0]
[null,null,null,null,null,null,null,null,null,null,null,null,null,null,null,null,null,null,null,null,null,{"$f":"Général!B29","v":"Equipage 29"},0]
[null,null,null,null,null,null,null,null,null,null,null,null,null,null,null,null,null,null,null,null,null,{"$f":"Général!B30","v":"Equipage 30"},0]

{"sheet":"Eq.9","index":14,"n_rows":29,"n_cols":23,"rows_kept":29,"cut":false,"hidden":true,"merged":[[7,0,7,1],[0,0,1,5],[0,6,1,10],[3,0,3,1],[4,0,4,1],[5,0,5,1],[14,0,14,1],[15,0,15,1],[8,0,8,1],[9,0,9,1],[10,0,10,1],[11,0,11,1],[12,0,12,1],[13,0,13,1]]}
["Equipage ",null,null,null,null,null,{"$f":"Général!B11","v":"Equipage 9"},null,null,null,null,null,null,null,null,null,null,null,null,null,null,{"$f":"Général!B3","v":"Equipage 1"},{"$f":"COUNTIF(C$8:R$16,V1)","v":5}]
[null,null,null,null,null,null,null,null,null,null,null,null,null,null,null,null,null,null,null,null,null,{"$f":"Général!B4","v":"Equipage 2"},{"$f":"COUNTIF($C$8:$R$16,V2)","v":10}]
[null,null,null,null,null,null,null,null,null,null,null,null,null,null,null,null,null,null,null,null,null,{"$f":"Général!B5","v":"Equipage 3"},9]
[null,null,"FLIGHT 1","FLIGHT 2","FLIGHT 3","FLIGHT 4","FLIGHT 5","FLIGHT 6","FLIGHT 7","FLIGHT 8","FLIGHT 9","FLIGHT 10","FLIGHT 11","FLIGHT 12","FLIGHT 13","FLIGHT 14","FLIGHT 15","FLIGHT 16","FLIGHT 17","FLIGHT 18",null,{"$f":"Général!B6","v":"Equipage 4"},5]
["N° de course",null,{"$f":"IF(COUNTIF(Général!B34:K34,$G$1)=1,\"Course 1\",IF(COUNTIF(Général!B36:K36,$G$1)=1,\"Course 2\",IF(COUNTIF(Général!#REF!,$G$1)=1,\"Course 3\",\"Course 4\")))","v":"Course 2"},{"$f":"IF(COUNTIF(Général!B42:K42,$G$1)=1,\"Course 1\",IF(COUNTIF(Général!B44:K44,$G$1)=1,\"Course 2\",IF(COUNTIF(Général!#REF!,$G$1)=1,\"Course 3\",\"Course 4\")))","v":"Course 1"},{"$f":"IF(COUNTIF(Général!B50:K50,$G$1)=1,\"Course 1\",IF(COUNTIF(Général!B52:K52,$G$1)=1,\"Course 2\",IF(COUNTIF(Général!#REF!,$G$1)=1,\"Course 3\",\"Course 4\")))","v":"Course 2"},{"$f":"IF(COUNTIF(Général!B58:K58,$G$1)=1,\"Course 1\",IF(COUNTIF(Général!B60:K60,$G$1)=1,\"Course 2\",IF(COUNTIF(Général!#REF!,$G$1)=1,\"Course 3\",\"Course 4\")))","v":"Course 1"},{"$f":"IF(COUNTIF(Général!B66:K66,$G$1)=1,\"Course 1\",IF(COUNTIF(Général!B68:K68,$G$1)=1,\"Course 2\",IF(COUNTIF(Général!#REF!,$G$1)=1,\"Course 3\",\"Course 4\")))","v":"Course 1"},{"$f":"IF(COUNTIF(Général!B74:K74,$G$1)=1,\"Course 1\",IF(COUNTIF(Général!B76:K76,$G$1)=1,\"Course 2\",IF(COUNTIF(Général!#REF!,$G$1)=1,\"Course 3\",\"Course 4\")))","v":"Course 2"},{"$f":"IF(COUNTIF(Général!B82:K82,$G$1)=1,\"Course 1\",IF(COUNTIF(Général!B84:K84,$G$1)=1,\"Course 2\",IF(COUNTIF(Général!#REF!,$G$1)=1,\"Course 3\",\"Course 4\")))","v":"Course 2"},{"$f":"IF(COUNTIF(Général!B90:K90,$G$1)=1,\"Course 1\",IF(COUNTIF(Général!B92:K92,$G$1)=1,\"Course 2\",IF(COUNTIF(Général!#REF!,$G$1)=1,\"Course 3\",\"Course 4\")))","v":"Course 1"},{"$f":"IF(COUNTIF(Général!B98:K98,$G$1)=1,\"Course 1\",IF(COUNTIF(Général!B100:K100,$G$1)=1,\"Course 2\",IF(COUNTIF(Général!#REF!,$G$1)=1,\"Course 3\",\"Course 4\")))","v":"Course 1"},{"$f":"IF(COUNTIF(Général!B106:K106,$G$1)=1,\"Course 1\",IF(COUNTIF(Général!B108:K108,$G$1)=1,\"Course 2\",IF(COUNTIF(Général!#REF!,$G$1)=1,\"Course 3\",\"Course 4\")))","v":"Course 2"},{"$f":"IF(COUNTIF(Général!B114:K114,$G$1)=1,\"Course 1\",IF(COUNTIF(Général!B116:K116,$G$1)=1,\"Course 2\",IF(COUNTIF(Général!#REF!,$G$1)=1,\"Course 3\",\"Course 4\")))","v":"Course 1"},{"$f":"IF(COUNTIF(Général!B122:K122,$G$1)=1,\"Course 1\",IF(COUNTIF(Général!B124:K124,$G$1)=1,\"Course 2\",IF(COUNTIF(Général!#REF!,$G$1)=1,\"Course 3\",\"Course 4\")))","v":"Course 1"},{"$f":"IF(COUNTIF(Général!B130:K130,$G$1)=1,\"Course 1\",IF(COUNTIF(Général!B132:K132,$G$1)=1,\"Course 2\",IF(COUNTIF(Général!#REF!,$G$1)=1,\"Course 3\",\"Course 4\")))","v":"Course 1"},{"$f":"IF(COUNTIF(Général!B138:K138,$G$1)=1,\"Course 1\",IF(COUNTIF(Général!B140:K140,$G$1)=1,\"Course 2\",IF(COUNTIF(Général!#REF!,$G$1)=1,\"Course 3\",\"Course 4\")))","v":"Course 1"},{"$f":"IF(COUNTIF(Général!B146:K146,$G$1)=1,\"Course 1\",IF(COUNTIF(Général!B148:K148,$G$1)=1,\"Course 2\",IF(COUNTIF(Général!#REF!,$G$1)=1,\"Course 3\",\"Course 4\")))","v":"Course 2"},{"$f":"IF(COUNTIF(Général!B154:K154,$G$1)=1,\"Course 1\",IF(COUNTIF(Général!B156:K156,$G$1)=1,\"Course 2\",IF(COUNTIF(Général!B158:K158,$G$1)=1,\"Course 3\",\"Course 4\")))","v":"Course 2"},{"$f":"IF(COUNTIF(Général!C154:L154,$G$1)=1,\"Course 1\",IF(COUNTIF(Général!C156:L156,$G$1)=1,\"Course 2\",IF(COUNTIF(Général!C158:L158,$G$1)=1,\"Course 3\",\"Course 4\")))","v":"Course 2"},{"$f":"IF(COUNTIF(Général!D154:M154,$G$1)=1,\"Course 1\",IF(COUNTIF(Général!D156:M156,$G$1)=1,\"Course 2\",IF(COUNTIF(Général!D158:M158,$G$1)=1,\"Course 3\",\"Course 4\")))","v":"Course 4"},null,{"$f":"Général!B7","v":"Equipage 5"},6]
["Bateau",null,{"$f":"IF(COUNTIF(Général!B34:B38,$G$1)=1,\"Boat 1\",IF(COUNTIF(Général!C34:C38,$G$1)=1,\"Boat 2\",IF(COUNTIF(Général!D34:D38,$G$1)=1,\"Boat 3\",IF(COUNTIF(Général!E34:E38,$G$1)=1,\"Boat 4\",IF(COUNTIF(Général!F34:F38,$G$1)=1,\"Boat 5\",IF(COUNTIF(Général!G34:G38,$G$1)=1,\"Boat 6\",IF(COUNTIF(Général!H34:H38,$G$1)=1,\"Boat 7\",IF(COUNTIF(Général!I34:I38,$G$1)=1,\"Boat 8\",IF(COUNTIF(Général!J34:J38,$G$1)=1,\"Boat 9\",\"Boat10\")))))))))","v":"Boat 3"},{"$f":"IF(COUNTIF(Général!B42:B46,$G$1)=1,\"Boat 1\",IF(COUNTIF(Général!C42:C46,$G$1)=1,\"Boat 2\",IF(COUNTIF(Général!D42:D46,$G$1)=1,\"Boat 3\",IF(COUNTIF(Général!E42:E46,$G$1)=1,\"Boat 4\",IF(COUNTIF(Général!F42:F46,$G$1)=1,\"Boat 5\",IF(COUNTIF(Général!G42:G46,$G$1)=1,\"Boat 6\",IF(COUNTIF(Général!H42:H46,$G$1)=1,\"Boat 7\",IF(COUNTIF(Général!I42:I46,$G$1)=1,\"Boat 8\",IF(COUNTIF(Général!J42:J46,$G$1)=1,\"Boat 9\",\"Boat 10\")))))))))","v":"Boat 3"},{"$f":"IF(COUNTIF(Général!B50:B54,$G$1)=1,\"Boat 1\",IF(COUNTIF(Général!C50:C54,$G$1)=1,\"Boat 2\",IF(COUNTIF(Général!D50:D54,$G$1)=1,\"Boat 3\", IF(COUNTIF(Général!E50:E54,$G$1)=1,\"Boat 4\", IF(COUNTIF(Général!F50:F54,$G$1)=1,\"Boat 5\", IF(COUNTIF(Général!G50:G54,$G$1)=1,\"Boat 6\", IF(COUNTIF(Général!H50:H54,$G$1)=1,\"Boat 7\",IF(COUNTIF(Général!I50:I54,$G$1)=1,\"Boat 8\",IF(COUNTIF(Général!J50:J54,$G$1)=1,\"Boat 9\",\"Boat 10\")))))))))","v":"Boat 4"},{"$f":"IF(COUNTIF(Général!B58:B62,$G$1)=1,\"Boat 1\",IF(COUNTIF(Général!C58:C62,$G$1)=1,\"Boat 2\",IF(COUNTIF(Général!D58:D62,$G$1)=1,\"Boat 3\", IF(COUNTIF(Général!E58:E62,$G$1)=1,\"Boat 4\", IF(COUNTIF(Général!F58:F62,$G$1)=1,\"Boat 5\", IF(COUNTIF(Général!G58:G62,$G$1)=1,\"Boat 6\", IF(COUNTIF(Général!H58:H62,$G$1)=1,\"Boat 7\",IF(COUNTIF(Général!I58:I62,$G$1)=1,\"Boat 8\",IF(COUNTIF(Général!I58:J62,$G$1)=1,\"Boat 9\",\"Boat 10\")))))))))","v":"Boat 4"},{"$f":"IF(COUNTIF(Général!B66:B70,$G$1)=1,\"Boat 1\",IF(COUNTIF(Général!C66:C70,$G$1)=1,\"Boat 2\",IF(COUNTIF(Général!D66:D70,$G$1)=1,\"Boat 3\", IF(COUNTIF(Général!E66:E70,$G$1)=1,\"Boat 4\", IF(COUNTIF(Général!F66:F70,$G$1)=1,\"Boat 5\", IF(COUNTIF(Général!G66:G70,$G$1)=1,\"Boat 6\", IF(COUNTIF(Général!H66:H70,$G$1)=1,\"Boat 7\",IF(COUNTIF(Général!I66:I70,$G$1)=1,\"Boat 8\",IF(COUNTIF(Général!J66:J70,$G$1)=1,\"Boat 9\",\"Boat 10\")))))))))","v":"Boat 4"},{"$f":"IF(COUNTIF(Général!B74:B78,$G$1)=1,\"Boat 1\",IF(COUNTIF(Général!C74:C78,$G$1)=1,\"Boat 2\",IF(COUNTIF(Général!D74:D78,$G$1)=1,\"Boat 3\", IF(COUNTIF(Général!E74:E78,$G$1)=1,\"Boat 4\", IF(COUNTIF(Général!F74:F78,$G$1)=1,\"Boat 5\", IF(COUNTIF(Général!G74:G78,$G$1)=1,\"Boat 6\", IF(COUNTIF(Général!H74:H78,$G$1)=1,\"Boat 7\",IF(COUNTIF(Général!I74:I78,$G$1)=1,\"Boat 8\",IF(COUNTIF(Général!J74:J78,$G$1)=1,\"Boat 9\",\"Boat 10\")))))))))","v":"Boat 3"},{"$f":"IF(COUNTIF(Général!B82:B86,$G$1)=1,\"Boat 1\",IF(COUNTIF(Général!C82:C86,$G$1)=1,\"Boat 2\",IF(COUNTIF(Général!D82:D86,$G$1)=1,\"Boat 3\", IF(COUNTIF(Général!E82:E86,$G$1)=1,\"Boat 4\", IF(COUNTIF(Général!F82:F86,$G$1)=1,\"Boat 5\", IF(COUNTIF(Général!G82:G86,$G$1)=1,\"Boat 6\", IF(COUNTIF(Général!H82:H86,$G$1)=1,\"Boat 7\",IF(COUNTIF(Général!I82:I86,$G$1)=1,\"Boat 8\",IF(COUNTIF(Général!J82:J86,$G$1)=1,\"Boat 9\",\"Boat 10\")))))))))","v":"Boat 2"},{"$f":"IF(COUNTIF(Général!B90:B94,$G$1)=1,\"Boat 1\",IF(COUNTIF(Général!C90:C94,$G$1)=1,\"Boat 2\",IF(COUNTIF(Général!D90:D94,$G$1)=1,\"Boat 3\", IF(COUNTIF(Général!E90:E94,$G$1)=1,\"Boat 4\", IF(COUNTIF(Général!F90:F94,$G$1)=1,\"Boat 5\", IF(COUNTIF(Général!G90:G94,$G$1)=1,\"Boat 6\", IF(COUNTIF(Général!H90:H94,$G$1)=1,\"Boat 7\",IF(COUNTIF(Général!I90:I94,$G$1)=1,\"Boat 8\",IF(COUNTIF(Général!J90:J94,$G$1)=1,\"Boat 9\",\"Boat 10\")))))))))","v":"Boat 2"},{"$f":"IF(COUNTIF(Général!B98:B102,$G$1)=1,\"Boat 1\",IF(COUNTIF(Général!C98:C102,$G$1)=1,\"Boat 2\",IF(COUNTIF(Général!D98:D102,$G$1)=1,\"Boat 3\", IF(COUNTIF(Général!E98:E102,$G$1)=1,\"Boat 4\", IF(COUNTIF(Général!F98:F102,$G$1)=1,\"Boat 5\", IF(COUNTIF(Général!G98:G102,$G$1)=1,\"Boat 6\", IF(COUNTIF(Général!H98:H102,$G$1)=1,\"Boat 7\",IF(COUNTIF(Général!I98:I102,$G$1)=1,\"Boat 8\",IF(COUNTIF(Général!J98:J102,$G$1)=1,\"Boat 9\",\"Boat 10\")))))))))","v":"Boat 3"},{"$f":"IF(COUNTIF(Général!B106:B110,$G$1)=1,\"Boat 1\",IF(COUNTIF(Général!C106:C110,$G$1)=1,\"Boat 2\",IF(COUNTIF(Général!D106:D110,$G$1)=1,\"Boat 3\", IF(COUNTIF(Général!E106:E110,$G$1)=1,\"Boat 4\", IF(COUNTIF(Général!F106:F110,$G$1)=1,\"Boat 5\", IF(COUNTIF(Général!G106:G110,$G$1)=1,\"Boat 6\", IF(COUNTIF(Général!H106:H110,$G$1)=1,\"Boat 7\",IF(COUNTIF(Général!I106:I110,$G$1)=1,\"Boat 8\",IF(COUNTIF(Général!J106:J110,$G$1)=1,\"Boat 9\",\"Boat 10\")))))))))","v":"Boat 5"},{"$f":"IF(COUNTIF(Général!B114:B118,$G$1)=1,\"Boat 1\",IF(COUNTIF(Général!C114:C118,$G$1)=1,\"Boat 2\",IF(COUNTIF(Général!C114:D118,$G$1)=1,\"Boat 3\", IF(COUNTIF(Général!C114:E118,$G$1)=1,\"Boat 4\", IF(COUNTIF(Général!F114:F118,$G$1)=1,\"Boat 5\", IF(COUNTIF(Général!G114:G118,$G$1)=1,\"Boat 6\", IF(COUNTIF(Général!H114:H118,$G$1)=1,\"Boat 7\",IF(COUNTIF(Général!I114:I118,$G$1)=1,\"Boat 8\",IF(COUNTIF(Général!J114:J118,$G$1)=1,\"Boat 9\",\"Boat 10\")))))))))","v":"Boat 5"},{"$f":"IF(COUNTIF(Général!B122:B126,$G$1)=1,\"Boat 1\",IF(COUNTIF(Général!C122:C126,$G$1)=1,\"Boat 2\",IF(COUNTIF(Général!D122:D126,$G$1)=1,\"Boat 3\", IF(COUNTIF(Général!E122:E126,$G$1)=1,\"Boat 4\", IF(COUNTIF(Général!F122:F126,$G$1)=1,\"Boat 5\", IF(COUNTIF(Général!G122:G126,$G$1)=1,\"Boat 6\", IF(COUNTIF(Général!H122:H126,$G$1)=1,\"Boat 7\",IF(COUNTIF(Général!I122:I126,$G$1)=1,\"Boat 8\",IF(COUNTIF(Général!J122:J126,$G$1)=1,\"Boat 9\",\"Boat 10\")))))))))","v":"Boat 1"},{"$f":"IF(COUNTIF(Général!B130:B134,$G$1)=1,\"Boat 1\",IF(COUNTIF(Général!C130:C134,$G$1)=1,\"Boat 2\",IF(COUNTIF(Général!D130:D134,$G$1)=1,\"Boat 3\", IF(COUNTIF(Général!E130:E134,$G$1)=1,\"Boat 4\", IF(COUNTIF(Général!F130:F134,$G$1)=1,\"Boat 5\", IF(COUNTIF(Général!G130:G134,$G$1)=1,\"Boat 6\", IF(COUNTIF(Général!H130:H134,$G$1)=1,\"Boat 7\",IF(COUNTIF(Général!I130:I134,$G$1)=1,\"Boat 8\",IF(COUNTIF(Général!J130:J134,$G$1)=1,\"Boat 9\",\"Boat 10\")))))))))","v":"Boat 5"},{"$f":"IF(COUNTIF(Général!B138:B142,$G$1)=1,\"Boat 1\",IF(COUNTIF(Général!C138:C142,$G$1)=1,\"Boat 2\",IF(COUNTIF(Général!D138:D142,$G$1)=1,\"Boat 3\", IF(COUNTIF(Général!E138:E142,$G$1)=1,\"Boat 4\", IF(COUNTIF(Général!F138:F142,$G$1)=1,\"Boat 5\", IF(COUNTIF(Général!G138:G142,$G$1)=1,\"Boat 6\", IF(COUNTIF(Général!H138:H142,$G$1)=1,\"Boat 7\",IF(COUNTIF(Général!I138:I142,$G$1)=1,\"Boat 8\",IF(COUNTIF(Général!J138:J142,$G$1)=1,\"Boat 9\",\"Boat 10\")))))))))","v":"Boat 1"},{"$f":"IF(COUNTIF(Général!B146:B150,$G$1)=1,\"Boat 1\",IF(COUNTIF(Général!C146:C150,$G$1)=1,\"Boat 2\",IF(COUNTIF(Général!D146:D150,$G$1)=1,\"Boat 3\", IF(COUNTIF(Général!E146:E150,$G$1)=1,\"Boat 4\", IF(COUNTIF(Général!F146:F150,$G$1)=1,\"Boat 5\", IF(COUNTIF(Général!G146:G150,$G$1)=1,\"Boat 6\", IF(COUNTIF(Général!H146:H150,$G$1)=1,\"Boat 7\",IF(COUNTIF(Général!I146:I150,$G$1)=1,\"Boat 8\",IF(COUNTIF(Général!J146:J150,$G$1)=1,\"Boat 9\",\"Boat 10\")))))))))","v":"Boat 1"},{"$f":"IF(COUNTIF(Général!B154:B157,$G$1)=1,\"Boat 1\",IF(COUNTIF(Général!C154:C157,$G$1)=1,\"Boat 2\",IF(COUNTIF(Général!D154:D157,$G$1)=1,\"Boat 3\", IF(COUNTIF(Général!E154:E157,$G$1)=1,\"Boat 4\", IF(COUNTIF(Général!F154:F157,$G$1)=1,\"Boat 5\", IF(COUNTIF(Général!G154:G157,$G$1)=1,\"Boat 6\", IF(COUNTIF(Général!H154:H157,$G$1)=1,\"Boat 7\",IF(COUNTIF(Général!I154:I157,$G$1)=1,\"Boat 8\",IF(COUNTIF(Général!J154:J157,$G$1)=1,\"Boat 9\",\"Boat 10\")))))))))","v":"Boat 2"},{"$f":"IF(COUNTIF(Général!B160:B163,$G$1)=1,\"Boat 1\",IF(COUNTIF(Général!C160:C163,$G$1)=1,\"Boat 2\",IF(COUNTIF(Général!D160:D163,$G$1)=1,\"Boat 3\", IF(COUNTIF(Général!E160:E163,$G$1)=1,\"Boat 4\", IF(COUNTIF(Général!F160:F163,$G$1)=1,\"Boat 5\", IF(COUNTIF(Général!G160:G163,$G$1)=1,\"Boat 6\", IF(COUNTIF(Général!H160:H163,$G$1)=1,\"Boat 7\",IF(COUNTIF(Général!I160:I163,$G$1)=1,\"Boat 8\",IF(COUNTIF(Général!J160:J163,$G$1)=1,\"Boat 9\",\"Boat 10\")))))))))","v":"Boat 2"},{"$f":"IF(COUNTIF(Général!B166:B169,$G$1)=1,\"Boat 1\",IF(COUNTIF(Général!C166:C169,$G$1)=1,\"Boat 2\",IF(COUNTIF(Général!D166:D169,$G$1)=1,\"Boat 3\", IF(COUNTIF(Général!E166:E169,$G$1)=1,\"Boat 4\", IF(COUNTIF(Général!F166:F169,$G$1)=1,\"Boat 5\", IF(COUNTIF(Général!G166:G169,$G$1)=1,\"Boat 6\", IF(COUNTIF(Général!H166:H169,$G$1)=1,\"Boat 7\",IF(COUNTIF(Général!I166:I169,$G$1)=1,\"Boat 8\",IF(COUNTIF(Général!J166:J169,$G$1)=1,\"Boat 9\",\"Boat 10\")))))))))","v":"Boat 2"},null,{"$f":"Général!B8","v":"Equipage 6"},11]
[null,null,null,null,null,null,null,null,null,null,null,null,null,null,null,null,null,null,null,null,null,{"$f":"Général!B9","v":"Equipage 7"},4]
["1er Equipage",null,{"$f":"IF($C$5=\"Course 1\",Général!B34,IF($C$5=\"Course 2\",Général!B36,IF($C$5=\"Course 3\",Général!#REF!,Général!B38)))","v":"Equipage 8"},{"$f":"IF($D$5=\"Course 1\",Général!B42,IF($D$5=\"Course 2\",Général!B44,IF($D$5=\"Course 3\",Général!#REF!,Général!B46)))","v":"Equipage 8"},{"$f":"IF($E$5=\"Course 1\",Général!B50,IF($E$5=\"Course 2\",Général!B52,IF($E$5=\"Course 3\",Général!#REF!,Général!B54)))","v":"Equipage 1"},{"$f":"IF($F$5=\"Course 1\",Général!B$58,IF($F$5=\"Course 2\",Général!B$60,IF($F$5=\"Course 3\",Général!#REF!,Général!B$62)))","v":"Equipage 10"},{"$f":"IF($G$5=\"Course 1\",Général!B$66,IF($G$5=\"Course 2\",Général!B$68,IF($G$5=\"Course 3\",Général!#REF!,Général!B$70)))","v":"Equipage 2"},{"$f":"IF($H$5=\"Course 1\",Général!B$74,IF($H$5=\"Course 2\",Général!B$76,IF($H$5=\"Course 3\",Général!#REF!,Général!B$78)))","v":"Equipage 4"},{"$f":"IF($I$5=\"Course 1\",Général!B$82,IF($I$5=\"Course 2\",Général!B$84,IF($I$5=\"Course 3\",Général!#REF!,Général!B$86)))","v":"Equipage 6"},{"$f":"IF($J$5=\"Course 1\",Général!B$90,IF($J$5=\"Course 2\",Général!B$92,IF($J$5=\"Course 3\",Général!#REF!,Général!B$94)))","v":"Equipage 6"},{"$f":"IF($K$5=\"Course 1\",Général!B$98,IF($K$5=\"Course 2\",Général!B$100,IF($K$5=\"Course 3\",Général!#REF!,Général!B$102)))","v":"Equipage 6"},{"$f":"IF($L$5=\"Course 1\",Général!B$106,IF($L$5=\"Course 2\",Général!B$108,IF($L$5=\"Course 3\",Général!#REF!,Général!B$110)))","v":"Equipage 10"},{"$f":"IF($M$5=\"Course 1\",Général!B$114,IF($M$5=\"Course 2\",Général!B$116,IF($M$5=\"Course 3\",Général!#REF!,Général!B$118)))","v":"Equipage 5"},{"$f":"IF($N$5=\"Course 1\",Général!B$122,IF($N$5=\"Course 2\",Général!B$124,IF($N$5=\"Course 3\",Général!#REF!,Général!B$126)))","v":"Equipage 9"},{"$f":"IF($O$5=\"Course 1\",Général!B$130,IF($O$5=\"Course 2\",Général!B$132,IF($O$5=\"Course 3\",Général!#REF!,Général!B$134)))","v":"Equipage 8"},{"$f":"IF($P$5=\"Course 1\",Général!B$138,IF($P$5=\"Course 2\",Général!B$140,IF($P$5=\"Course 3\",Général!#REF!,Général!B$142)))","v":"Equipage 9"},{"$f":"IF($Q$5=\"Course 1\",Général!B$146,IF($Q$5=\"Course 2\",Général!B$148,IF($Q$5=\"Course 3\",Général!#REF!,Général!B$150)))","v":"Equipage 9"},{"$f":"IF($R$5=\"Course 1\",Général!B$154,IF($R$5=\"Course 2\",Général!B$156,IF($R$5=\"Course 3\",Général!B$158,Général!B$160)))","v":"Equipage 3"},null,null,null,{"$f":"Général!B10","v":"Equipage 8"},8]
["2nd Equipage",null,{"$f":"IF($C$5=\"Course 1\",Général!C34,IF($C$5=\"Course 2\",Général!C36,IF($C$5=\"Course 3\",Général!#REF!,Général!C38)))","v":"Equipage 5"},{"$f":"IF($D$5=\"Course 1\",Général!C42,IF($D$5=\"Course 2\",Général!C44,IF($D$5=\"Course 3\",Général!#REF!,Général!C46)))","v":"Equipage 4"},{"$f":"IF($E$5=\"Course 1\",Général!C50,IF($E$5=\"Course 2\",Général!C52,IF($E$5=\"Course 3\",Général!#REF!,Général!C54)))","v":"Equipage 2"},{"$f":"IF($F$5=\"Course 1\",Général!C$58,IF($F$5=\"Course 2\",Général!C$60,IF($F$5=\"Course 3\",Général!#REF!,Général!C$62)))","v":"Equipage 7"},{"$f":"IF($G$5=\"Course 1\",Général!C$66,IF($G$5=\"Course 2\",Général!C$68,IF($G$5=\"Course 3\",Général!#REF!,Général!C$70)))","v":"Equipage 3"},{"$f":"IF($H$5=\"Course 1\",Général!C$74,IF($H$5=\"Course 2\",Général!C$76,IF($H$5=\"Course 3\",Général!#REF!,Général!C$78)))","v":"Equipage 8"},{"$f":"IF($I$5=\"Course 1\",Général!C$82,IF($I$5=\"Course 2\",Général!C$84,IF($I$5=\"Course 3\",Général!#REF!,Général!C$86)))","v":"Equipage 9"},{"$f":"IF($J$5=\"Course 1\",Général!C$90,IF($J$5=\"Course 2\",Général!C$92,IF($J$5=\"Course 3\",Général!#REF!,Général!C$94)))","v":"Equipage 9"},{"$f":"IF($K$5=\"Course 1\",Général!C$98,IF($K$5=\"Course 2\",Général!C$100,IF($K$5=\"Course 3\",Général!#REF!,Général!C$102)))","v":"Equipage 1"},{"$f":"IF($L$5=\"Course 1\",Général!C$106,IF($L$5=\"Course 2\",Général!C$108,IF($L$5=\"Course 3\",Général!#REF!,Général!C$110)))","v":"Equipage 4"},{"$f":"IF($M$5=\"Course 1\",Général!C$114,IF($M$5=\"Course 2\",Général!C$116,IF($M$5=\"Course 3\",Général!#REF!,Général!C$118)))","v":"Equipage 2"},{"$f":"IF($N$5=\"Course 1\",Général!C$122,IF($N$5=\"Course 2\",Général!C$124,IF($N$5=\"Course 3\",Général!#REF!,Général!C$126)))","v":"Equipage 6"},{"$f":"IF($O$5=\"Course 1\",Général!C$130,IF($O$5=\"Course 2\",Général!C$132,IF($O$5=\"Course 3\",Général!#REF!,Général!C$134)))","v":"Equipage 3"},{"$f":"IF($P$5=\"Course 1\",Général!C$138,IF($P$5=\"Course 2\",Général!C$140,IF($P$5=\"Course 3\",Général!#REF!,Général!C$142)))","v":"Equipage 2"},{"$f":"IF($Q$5=\"Course 1\",Général!C$146,IF($Q$5=\"Course 2\",Général!C$148,IF($Q$5=\"Course 3\",Général!#REF!,Général!C$150)))","v":"Equipage 7"},{"$f":"IF($R$5=\"Course 1\",Général!C$154,IF($R$5=\"Course 2\",Général!C$156,IF($R$5=\"Course 3\",Général!C$158,Général!C$160)))","v":"Equipage 9"},null,null,null,{"$f":"Général!B11","v":"Equipage 9"},16]
["3ème Equipage",null,{"$f":"IF($C$5=\"Course 1\",Général!D34,IF($C$5=\"Course 2\",Général!D36,IF($C$5=\"Course 3\",Général!#REF!,Général!D38)))","v":"Equipage 9"},{"$f":"IF($D$5=\"Course 1\",Général!D42,IF($D$5=\"Course 2\",Général!D44,IF($D$5=\"Course 3\",Général!#REF!,Général!D46)))","v":"Equipage 9"},{"$f":"IF($E$5=\"Course 1\",Général!D50,IF($E$5=\"Course 2\",Général!D52,IF($E$5=\"Course 3\",Général!#REF!,Général!D54)))","v":"Equipage 3"},{"$f":"IF($F$5=\"Course 1\",Général!D$58,IF($F$5=\"Course 2\",Général!D$60,IF($F$5=\"Course 3\",Général!#REF!,Général!D$62)))","v":"Equipage 3"},{"$f":"IF($G$5=\"Course 1\",Général!D$66,IF($G$5=\"Course 2\",Général!D$68,IF($G$5=\"Course 3\",Général!#REF!,Général!D$70)))","v":"Equipage 6"},{"$f":"IF($H$5=\"Course 1\",Général!D$74,IF($H$5=\"Course 2\",Général!D$76,IF($H$5=\"Course 3\",Général!#REF!,Général!D$78)))","v":"Equipage 9"},{"$f":"IF($I$5=\"Course 1\",Général!D$82,IF($I$5=\"Course 2\",Général!D$84,IF($I$5=\"Course 3\",Général!#REF!,Général!D$86)))","v":"Equipage 1"},{"$f":"IF($J$5=\"Course 1\",Général!D$90,IF($J$5=\"Course 2\",Général!D$92,IF($J$5=\"Course 3\",Général!#REF!,Général!D$94)))","v":"Equipage 5"},{"$f":"IF($K$5=\"Course 1\",Général!D$98,IF($K$5=\"Course 2\",Général!D$100,IF($K$5=\"Course 3\",Général!#REF!,Général!D$102)))","v":"Equipage 9"},{"$f":"IF($L$5=\"Course 1\",Général!D$106,IF($L$5=\"Course 2\",Général!D$108,IF($L$5=\"Course 3\",Général!#REF!,Général!D$110)))","v":"Equipage 1"},{"$f":"IF($M$5=\"Course 1\",Général!D$114,IF($M$5=\"Course 2\",Général!D$116,IF($M$5=\"Course 3\",Général!#REF!,Général!D$118)))","v":"Equipage 6"},{"$f":"IF($N$5=\"Course 1\",Général!D$122,IF($N$5=\"Course 2\",Général!D$124,IF($N$5=\"Course 3\",Général!#REF!,Général!D$126)))","v":"Equipage 10"},{"$f":"IF($O$5=\"Course 1\",Général!D$130,IF($O$5=\"Course 2\",Général!D$132,IF($O$5=\"Course 3\",Général!#REF!,Général!D$134)))","v":"Equipage 2"},{"$f":"IF($P$5=\"Course 1\",Général!D$138,IF($P$5=\"Course 2\",Général!D$140,IF($P$5=\"Course 3\",Général!#REF!,Général!D$142)))","v":"Equipage 6"},{"$f":"IF($Q$5=\"Course 1\",Général!D$146,IF($Q$5=\"Course 2\",Général!D$148,IF($Q$5=\"Course 3\",Général!#REF!,Général!D$150)))","v":"Equipage 10"},{"$f":"IF($R$5=\"Course 1\",Général!D$154,IF($R$5=\"Course 2\",Général!D$156,IF($R$5=\"Course 3\",Général!D$158,Général!D$160)))","v":"Equipage 2"},null,null,null,{"$f":"Général!B12","v":"Equipage 10"},6]
["4ème Equipage",null,{"$f":"IF($C$5=\"Course 1\",Général!E34,IF($C$5=\"Course 2\",Général!E36,IF($C$5=\"Course 3\",Général!#REF!,Général!E38)))","v":"Equipage 3"},{"$f":"IF($D$5=\"Course 1\",Général!E42,IF($D$5=\"Course 2\",Général!E44,IF($D$5=\"Course 3\",Général!#REF!,Général!E46)))","v":"Equipage 10"},{"$f":"IF($E$5=\"Course 1\",Général!E50,IF($E$5=\"Course 2\",Général!E52,IF($E$5=\"Course 3\",Général!#REF!,Général!E54)))","v":"Equipage 9"},{"$f":"IF($F$5=\"Course 1\",Général!E$58,IF($F$5=\"Course 2\",Général!E$60,IF($F$5=\"Course 3\",Général!#REF!,Général!E$62)))","v":"Equipage 9"},{"$f":"IF($G$5=\"Course 1\",Général!E$66,IF($G$5=\"Course 2\",Général!E$68,IF($G$5=\"Course 3\",Général!#REF!,Général!E$70)))","v":"Equipage 9"},{"$f":"IF($H$5=\"Course 1\",Général!E$74,IF($H$5=\"Course 2\",Général!E$76,IF($H$5=\"Course 3\",Général!#REF!,Général!E$78)))","v":"Equipage 10"},{"$f":"IF($I$5=\"Course 1\",Général!E$82,IF($I$5=\"Course 2\",Général!E$84,IF($I$5=\"Course 3\",Général!#REF!,Général!E$86)))","v":"Equipage 3"},{"$f":"IF($J$5=\"Course 1\",Général!E$90,IF($J$5=\"Course 2\",Général!E$92,IF($J$5=\"Course 3\",Général!#REF!,Général!E$94)))","v":"Equipage 4"},{"$f":"IF($K$5=\"Course 1\",Général!E$98,IF($K$5=\"Course 2\",Général!E$100,IF($K$5=\"Course 3\",Général!#REF!,Général!E$102)))","v":"Equipage 2"},{"$f":"IF($L$5=\"Course 1\",Général!E$106,IF($L$5=\"Course 2\",Général!E$108,IF($L$5=\"Course 3\",Général!#REF!,Général!E$110)))","v":"Equipage 8"},{"$f":"IF($M$5=\"Course 1\",Général!E$114,IF($M$5=\"Course 2\",Général!E$116,IF($M$5=\"Course 3\",Général!#REF!,Général!E$118)))","v":"Equipage 8"},{"$f":"IF($N$5=\"Course 1\",Général!E$122,IF($N$5=\"Course 2\",Général!E$124,IF($N$5=\"Course 3\",Général!#REF!,Général!E$126)))","v":"Equipage 2"},{"$f":"IF($O$5=\"Course 1\",Général!E$130,IF($O$5=\"Course 2\",Général!E$132,IF($O$5=\"Course 3\",Général!#REF!,Général!E$134)))","v":"Equipage 1"},{"$f":"IF($P$5=\"Course 1\",Général!E$138,IF($P$5=\"Course 2\",Général!E$140,IF($P$5=\"Course 3\",Général!#REF!,Général!E$142)))","v":"Equipage 5"},{"$f":"IF($Q$5=\"Course 1\",Général!E$146,IF($Q$5=\"Course 2\",Général!E$148,IF($Q$5=\"Course 3\",Général!#REF!,Général!E$150)))","v":"Equipage 6"},{"$f":"IF($R$5=\"Course 1\",Général!E$154,IF($R$5=\"Course 2\",Général!E$156,IF($R$5=\"Course 3\",Général!E$158,Général!E$160)))","v":"Equipage 5"}]
["5ème Equipage",null,{"$f":"IF($C$5=\"Course 1\",Général!F34,IF($C$5=\"Course 2\",Général!F36,IF($C$5=\"Course 3\",Général!#REF!,Général!F38)))","v":"Equipage 2"},{"$f":"IF($D$5=\"Course 1\",Général!F42,IF($D$5=\"Course 2\",Général!F44,IF($D$5=\"Course 3\",Général!#REF!,Général!F46)))","v":"Equipage 6"},{"$f":"IF($E$5=\"Course 1\",Général!F50,IF($E$5=\"Course 2\",Général!F52,IF($E$5=\"Course 3\",Général!#REF!,Général!F54)))","v":"Equipage 6"},{"$f":"IF($F$5=\"Course 1\",Général!F$58,IF($F$5=\"Course 2\",Général!F$60,IF($F$5=\"Course 3\",Général!#REF!,Général!F$62)))","v":"Equipage 6"},{"$f":"IF($G$5=\"Course 1\",Général!F$66,IF($G$5=\"Course 2\",Général!F$68,IF($G$5=\"Course 3\",Général!#REF!,Général!F$70)))","v":"Equipage 7"},{"$f":"IF($H$5=\"Course 1\",Général!F$74,IF($H$5=\"Course 2\",Général!F$76,IF($H$5=\"Course 3\",Général!#REF!,Général!F$78)))","v":"Equipage 5"},{"$f":"IF($I$5=\"Course 1\",Général!F$82,IF($I$5=\"Course 2\",Général!F$84,IF($I$5=\"Course 3\",Général!#REF!,Général!F$86)))","v":"Equipage 2"},{"$f":"IF($J$5=\"Course 1\",Général!F$90,IF($J$5=\"Course 2\",Général!F$92,IF($J$5=\"Course 3\",Général!#REF!,Général!F$94)))","v":"Equipage 7"},{"$f":"IF($K$5=\"Course 1\",Général!F$98,IF($K$5=\"Course 2\",Général!F$100,IF($K$5=\"Course 3\",Général!#REF!,Général!F$102)))","v":"Equipage 4"},{"$f":"IF($L$5=\"Course 1\",Général!F$106,IF($L$5=\"Course 2\",Général!$F108,IF($L$5=\"Course 3\",Général!#REF!,Général!F$110)))","v":"Equipage 9"},{"$f":"IF($M$5=\"Course 1\",Général!F$114,IF($M$5=\"Course 2\",Général!F$116,IF($M$5=\"Course 3\",Général!#REF!,Général!F$118)))","v":"Equipage 9"},{"$f":"IF($N$5=\"Course 1\",Général!F$122,IF($N$5=\"Course 2\",Général!F$124,IF($N$5=\"Course 3\",Général!#REF!,Général!F$126)))","v":"Equipage 3"},{"$f":"IF($O$5=\"Course 1\",Général!F$130,IF($O$5=\"Course 2\",Général!F$132,IF($O$5=\"Course 3\",Général!#REF!,Général!F$134)))","v":"Equipage 9"},{"$f":"IF($P$5=\"Course 1\",Général!F$138,IF($P$5=\"Course 2\",Général!F$140,IF($P$5=\"Course 3\",Général!#REF!,Général!F$142)))","v":"Equipage 8"},{"$f":"IF($Q$5=\"Course 1\",Général!F$146,IF($Q$5=\"Course 2\",Général!F$148,IF($Q$5=\"Course 3\",Général!#REF!,Général!F$150)))","v":"Equipage 3"},{"$f":"IF($R$5=\"Course 1\",Général!F$154,IF($R$5=\"Course 2\",Général!F$156,IF($R$5=\"Course 3\",Général!F$158,Général!F$160)))","v":"Equipage 8"}]
["7ème Equipage",null,{"$f":"IF($C$5=\"Course 1\",Général!H34,IF($C$5=\"Course 2\",Général!H36,IF($C$5=\"Course 3\",Général!#REF!,Général!H38)))","v":0},{"$f":"IF($D$5=\"Course 1\",Général!H42,IF($D$5=\"Course 2\",Général!H44,IF($D$5=\"Course 3\",Général!#REF!,Général!H46)))","v":0},{"$f":"IF($E$5=\"Course 1\",Général!H50,IF($E$5=\"Course 2\",Général!H52,IF($E$5=\"Course 3\",Général!#REF!,Général!H54)))","v":0},{"$f":"IF($F$5=\"Course 1\",Général!H$58,IF($F$5=\"Course 2\",Général!H$60,IF($F$5=\"Course 3\",Général!#REF!,Général!H$62)))","v":0},{"$f":"IF($G$5=\"Course 1\",Général!H$66,IF($G$5=\"Course 2\",Général!H$68,IF($G$5=\"Course 3\",Général!#REF!,Général!H$70)))","v":0},{"$f":"IF($H$5=\"Course 1\",Général!H$74,IF($H$5=\"Course 2\",Général!H$76,IF($H$5=\"Course 3\",Général!#REF!,Général!H$78)))","v":0},{"$f":"IF($I$5=\"Course 1\",Général!H$82,IF($I$5=\"Course 2\",Général!H$84,IF($I$5=\"Course 3\",Général!#REF!,Général!H$86)))","v":0},{"$f":"IF($J$5=\"Course 1\",Général!H$90,IF($J$5=\"Course 2\",Général!H$92,IF($J$5=\"Course 3\",Général!#REF!,Général!H$94)))","v":0},{"$f":"IF($K$5=\"Course 1\",Général!H$98,IF($K$5=\"Course 2\",Général!H$100,IF($K$5=\"Course 3\",Général!#REF!,Général!H$102)))","v":0},{"$f":"IF($L$5=\"Course 1\",Général!H$106,IF($L$5=\"Course 2\",Général!H$108,IF($L$5=\"Course 3\",Général!#REF!,Général!H$110)))","v":0},{"$f":"IF($M$5=\"Course 1\",Général!H$114,IF($M$5=\"Course 2\",Général!H$116,IF($M$5=\"Course 3\",Général!#REF!,Général!H$118)))","v":0},{"$f":"IF($N$5=\"Course 1\",Général!H$122,IF($N$5=\"Course 2\",Général!H$124,IF($N$5=\"Course 3\",Général!#REF!,Général!H$126)))","v":0},{"$f":"IF($O$5=\"Course 1\",Général!H$130,IF($O$5=\"Course 2\",Général!H$132,IF($O$5=\"Course 3\",Général!#REF!,Général!H$134)))","v":0},{"$f":"IF($P$5=\"Course 1\",Général!H$138,IF($P$5=\"Course 2\",Général!H$140,IF($P$5=\"Course 3\",Général!#REF!,Général!H$142)))","v":0},{"$f":"IF($Q$5=\"Course 1\",Général!H$146,IF($Q$5=\"Course 2\",Général!H$148,IF($Q$5=\"Course 3\",Général!#REF!,Général!H$150)))","v":0},{"$f":"IF($R$5=\"Course 1\",Général!H$154,IF($R$5=\"Course 2\",Général!H$156,IF($R$5=\"Course 3\",Général!H$158,Général!H$160)))","v":0},null,null,null,{"$f":"Général!B14","v":"Equipage 14"},{"$f":"COUNTIF($C$8:$R$16,V13)","v":0}]
["8ème Equipage",null,{"$f":"IF($C$5=\"Course 1\",Général!I34,IF($C$5=\"Course 2\",Général!I36,IF($C$5=\"Course 3\",Général!#REF!,Général!I38)))","v":0},{"$f":"IF($D$5=\"Course 1\",Général!I42,IF($D$5=\"Course 2\",Général!I44,IF($D$5=\"Course 3\",Général!#REF!,Général!I46)))","v":0},{"$f":"IF($E$5=\"Course 1\",Général!I50,IF($E$5=\"Course 2\",Général!I52,IF($E$5=\"Course 3\",Général!#REF!,Général!I54)))","v":0},{"$f":"IF($F$5=\"Course 1\",Général!I$58,IF($F$5=\"Course 2\",Général!I$60,IF($F$5=\"Course 3\",Général!#REF!,Général!I$62)))","v":0},{"$f":"IF($G$5=\"Course 1\",Général!I$66,IF($G$5=\"Course 2\",Général!I$68,IF($G$5=\"Course 3\",Général!#REF!,Général!I$70)))","v":0},{"$f":"IF($H$5=\"Course 1\",Général!I$74,IF($H$5=\"Course 2\",Général!I$76,IF($H$5=\"Course 3\",Général!#REF!,Général!I$78)))","v":0},{"$f":"IF($I$5=\"Course 1\",Général!I$82,IF($I$5=\"Course 2\",Général!I$84,IF($I$5=\"Course 3\",Général!#REF!,Général!I$86)))","v":0},{"$f":"IF($J$5=\"Course 1\",Général!I$90,IF($J$5=\"Course 2\",Général!I$92,IF($J$5=\"Course 3\",Général!#REF!,Général!I$94)))","v":0},{"$f":"IF($K$5=\"Course 1\",Général!I$98,IF($K$5=\"Course 2\",Général!I$100,IF($K$5=\"Course 3\",Général!#REF!,Général!I$102)))","v":0},{"$f":"IF($L$5=\"Course 1\",Général!I$106,IF($L$5=\"Course 2\",Général!I$108,IF($L$5=\"Course 3\",Général!#REF!,Général!I$110)))","v":0},{"$f":"IF($M$5=\"Course 1\",Général!I$114,IF($M$5=\"Course 2\",Général!I$116,IF($M$5=\"Course 3\",Général!#REF!,Général!I$118)))","v":0},{"$f":"IF($N$5=\"Course 1\",Général!I$122,IF($N$5=\"Course 2\",Général!I$124,IF($N$5=\"Course 3\",Général!#REF!,Général!I$126)))","v":0},{"$f":"IF($O$5=\"Course 1\",Général!I$130,IF($O$5=\"Course 2\",Général!I$132,IF($O$5=\"Course 3\",Général!#REF!,Général!I$134)))","v":0},{"$f":"IF($P$5=\"Course 1\",Général!I$138,IF($P$5=\"Course 2\",Général!I$140,IF($P$5=\"Course 3\",Général!#REF!,Général!I$142)))","v":0},{"$f":"IF($Q$5=\"Course 1\",Général!I$146,IF($Q$5=\"Course 2\",Général!I$148,IF($Q$5=\"Course 3\",Général!#REF!,Général!I$150)))","v":0},{"$f":"IF($R$5=\"Course 1\",Général!I$154,IF($R$5=\"Course 2\",Général!I$156,IF($R$5=\"Course 3\",Général!I$158,Général!I$160)))","v":0},null,null,null,{"$f":"Général!B15","v":"Equipage 15"},0]
["9ème Equipage",null,{"$f":"IF($C$5=\"Course 1\",Général!J34,IF($C$5=\"Course 2\",Général!J36,IF($C$5=\"Course 3\",Général!#REF!,Général!J38)))","v":0},{"$f":"IF($D$5=\"Course 1\",Général!J42,IF($D$5=\"Course 2\",Général!J44,IF($D$5=\"Course 3\",Général!#REF!,Général!J46)))","v":0},{"$f":"IF($E$5=\"Course 1\",Général!J50,IF($E$5=\"Course 2\",Général!J52,IF($E$5=\"Course 3\",Général!#REF!,Général!J54)))","v":0},{"$f":"IF($F$5=\"Course 1\",Général!J$58,IF($F$5=\"Course 2\",Général!J$60,IF($F$5=\"Course 3\",Général!#REF!,Général!J$62)))","v":0},{"$f":"IF($G$5=\"Course 1\",Général!J$66,IF($G$5=\"Course 2\",Général!J$68,IF($G$5=\"Course 3\",Général!#REF!,Général!J$70)))","v":0},{"$f":"IF($H$5=\"Course 1\",Général!J$74,IF($H$5=\"Course 2\",Général!J$76,IF($H$5=\"Course 3\",Général!#REF!,Général!J$78)))","v":0},{"$f":"IF($I$5=\"Course 1\",Général!J$82,IF($I$5=\"Course 2\",Général!J$84,IF($I$5=\"Course 3\",Général!#REF!,Général!J$86)))","v":0},{"$f":"IF($J$5=\"Course 1\",Général!J$90,IF($J$5=\"Course 2\",Général!J$92,IF($J$5=\"Course 3\",Général!#REF!,Général!J$94)))","v":0},{"$f":"IF($K$5=\"Course 1\",Général!J$98,IF($K$5=\"Course 2\",Général!J$100,IF($K$5=\"Course 3\",Général!#REF!,Général!J$102)))","v":0},{"$f":"IF($L$5=\"Course 1\",Général!J$106,IF($L$5=\"Course 2\",Général!J$108,IF($L$5=\"Course 3\",Général!#REF!,Général!J$110)))","v":0},{"$f":"IF($M$5=\"Course 1\",Général!J$114,IF($M$5=\"Course 2\",Général!J$116,IF($M$5=\"Course 3\",Général!#REF!,Général!J$118)))","v":0},{"$f":"IF($N$5=\"Course 1\",Général!J$122,IF($N$5=\"Course 2\",Général!J$124,IF($N$5=\"Course 3\",Général!#REF!,Général!J$126)))","v":0},{"$f":"IF($O$5=\"Course 1\",Général!J$130,IF($O$5=\"Course 2\",Général!J$132,IF($O$5=\"Course 3\",Général!#REF!,Général!J$134)))","v":0},{"$f":"IF($P$5=\"Course 1\",Général!J$138,IF($P$5=\"Course 2\",Général!J$140,IF($P$5=\"Course 3\",Général!#REF!,Général!J$142)))","v":0},{"$f":"IF($Q$5=\"Course 1\",Général!J$146,IF($Q$5=\"Course 2\",Général!J$148,IF($Q$5=\"Course 3\",Général!#REF!,Général!J$150)))","v":0},{"$f":"IF($R$5=\"Course 1\",Général!J$154,IF($R$5=\"Course 2\",Général!J$156,IF($R$5=\"Course 3\",Général!J$158,Général!J$160)))","v":0},null,null,null,{"$f":"Général!B16","v":"Equipage 16"},0]
["10ème Equipage",null,{"$f":"IF($C$5=\"Course 1\",Général!K34,IF($C$5=\"Course 2\",Général!K36,IF($C$5=\"Course 3\",Général!#REF!,Général!K38)))","v":0},{"$f":"IF($D$5=\"Course 1\",Général!K42,IF($D$5=\"Course 2\",Général!K44,IF($D$5=\"Course 3\",Général!#REF!,Général!K46)))","v":0},{"$f":"IF($E$5=\"Course 1\",Général!K50,IF($E$5=\"Course 2\",Général!K52,IF($E$5=\"Course 3\",Général!#REF!,Général!K54)))","v":0},{"$f":"IF($F$5=\"Course 1\",Général!K$58,IF($F$5=\"Course 2\",Général!K$60,IF($F$5=\"Course 3\",Général!#REF!,Général!K$62)))","v":0},{"$f":"IF($G$5=\"Course 1\",Général!K$66,IF($G$5=\"Course 2\",Général!K$68,IF($G$5=\"Course 3\",Général!#REF!,Général!K$70)))","v":0},{"$f":"IF($H$5=\"Course 1\",Général!K$74,IF($H$5=\"Course 2\",Général!K$76,IF($H$5=\"Course 3\",Général!#REF!,Général!K$78)))","v":0},{"$f":"IF($I$5=\"Course 1\",Général!K$82,IF($I$5=\"Course 2\",Général!K$84,IF($I$5=\"Course 3\",Général!#REF!,Général!K$86)))","v":0},{"$f":"IF($J$5=\"Course 1\",Général!K$90,IF($J$5=\"Course 2\",Général!K$92,IF($J$5=\"Course 3\",Général!#REF!,Général!K$94)))","v":0},{"$f":"IF($K$5=\"Course 1\",Général!K$98,IF($K$5=\"Course 2\",Général!K$100,IF($K$5=\"Course 3\",Général!#REF!,Général!K$102)))","v":0},{"$f":"IF($L$5=\"Course 1\",Général!K$106,IF($L$5=\"Course 2\",Général!K$108,IF($L$5=\"Course 3\",Général!#REF!,Général!K$110)))","v":0},{"$f":"IF($M$5=\"Course 1\",Général!K$114,IF($M$5=\"Course 2\",Général!K$116,IF($M$5=\"Course 3\",Général!#REF!,Général!K$118)))","v":0},{"$f":"IF($N$5=\"Course 1\",Général!K$122,IF($N$5=\"Course 2\",Général!K$124,IF($N$5=\"Course 3\",Général!#REF!,Général!K$126)))","v":0},{"$f":"IF($O$5=\"Course 1\",Général!K$130,IF($O$5=\"Course 2\",Général!K$132,IF($O$5=\"Course 3\",Général!#REF!,Général!K$134)))","v":0},{"$f":"IF($P$5=\"Course 1\",Général!K$138,IF($P$5=\"Course 2\",Général!K$140,IF($P$5=\"Course 3\",Général!#REF!,Général!K$142)))","v":0},{"$f":"IF($Q$5=\"Course 1\",Général!K$146,IF($Q$5=\"Course 2\",Général!K$148,IF($Q$5=\"Course 3\",Général!#REF!,Général!K$150)))","v":0},{"$f":"IF($R$5=\"Course 1\",Général!K$154,IF($R$5=\"Course 2\",Général!K$156,IF($R$5=\"Course 3\",Général!K$158,Général!K$160)))","v":0},null,null,null,{"$f":"Général!B17","v":"Equipage 17"},0]
[null,null,null,null,null,null,null,null,null,null,null,null,null,null,null,null,null,null,null,null,null,{"$f":"Général!B18","v":"Equipage 18"},0]
[null,null,null,null,null,null,null,null,null,null,null,null,null,null,null,null,null,null,null,null,null,{"$f":"Général!B19","v":"Equipage 19"},0]
[null,null,null,null,null,null,null,null,null,null,null,null,null,null,null,null,null,null,null,null,null,{"$f":"Général!B20","v":"Equipage 20"},0]
[null,null,null,null,null,null,null,null,null,null,null,null,null,null,null,null,null,null,null,null,null,{"$f":"Général!B21","v":"Equipage 21"},0]
[null,null,null,null,null,null,null,null,null,null,null,null,null,null,null,null,null,null,null,null,null,{"$f":"Général!B22","v":"Equipage 22"},0]
[null,null,null,null,null,null,null,null,null,null,null,null,null,null,null,null,null,null,null,null,null,{"$f":"Général!B23","v":"Equipage 23"},0]
[null,null,null,null,null,null,null,null,null,null,null,null,null,null,null,null,null,null,null,null,null,{"$f":"Général!B24","v":"Equipage 24"},0]
[null,null,null,null,null,null,null,null,null,null,null,null,null,null,null,null,null,null,null,null,null,{"$f":"Général!B25","v":"Equipage 25"},0]
[null,null,null,null,null,null,null,null,null,null,null,null,null,null,null,null,null,null,null,null,null,{"$f":"Général!B26","v":"Equipage 26"},0]
[null,null,null,null,null,null,null,null,null,null,null,null,null,null,null,null,null,null,null,null,null,{"$f":"Général!B27","v":"Equipage 27"},0]
[null,null,null,null,null,null,null,null,null,null,null,null,null,null,null,null,null,null,null,null,null,{"$f":"Général!B28","v":"Equipage 28"},0]
[null,null,null,null,null,null,null,null,null,null,null,null,null,null,null,null,null,null,null,null,null,{"$f":"Général!B29","v":"Equipage 29"},0]
[null,null,null,null,null,null,null,null,null,null,null,null,null,null,null,null,null,null,null,null,null,{"$f":"Général!B30","v":"Equipage 30"},0]

{"sheet":"Eq.10","index":15,"n_rows":29,"n_cols":23,"rows_kept":29,"cut":false,"hidden":true,"merged":[[7,0,7,1],[0,0,1,5],[0,6,1,10],[3,0,3,1],[4,0,4,1],[5,0,5,1],[14,0,14,1],[15,0,15,1],[8,0,8,1],[9,0,9,1],[10,0,10,1],[11,0,11,1],[12,0,12,1],[13,0,13,1]]}
["Equipage ",null,null,null,null,null,{"$f":"Général!B12","v":"Equipage 10"},null,null,null,null,null,null,null,null,null,null,null,null,null,null,{"$f":"Général!B3","v":"Equipage 1"},{"$f":"COUNTIF(C$8:R$16,V1)","v":7}]
[null,null,null,null,null,null,null,null,null,null,null,null,null,null,null,null,null,null,null,null,null,{"$f":"Général!B4","v":"Equipage 2"},{"$f":"COUNTIF($C$8:$R$16,V2)","v":2}]
[null,null,null,null,null,null,null,null,null,null,null,null,null,null,null,null,null,null,null,null,null,{"$f":"Général!B5","v":"Equipage 3"},7]
[null,null,"FLIGHT 1","FLIGHT 2","FLIGHT 3","FLIGHT 4","FLIGHT 5","FLIGHT 6","FLIGHT 7","FLIGHT 8","FLIGHT 9","FLIGHT 10","FLIGHT 11","FLIGHT 12","FLIGHT 13","FLIGHT 14","FLIGHT 15","FLIGHT 16","FLIGHT 17","FLIGHT 18",null,{"$f":"Général!B6","v":"Equipage 4"},11]
["N° de course",null,{"$f":"IF(COUNTIF(Général!B34:K34,$G$1)=1,\"Course 1\",IF(COUNTIF(Général!B36:K36,$G$1)=1,\"Course 2\",IF(COUNTIF(Général!#REF!,$G$1)=1,\"Course 3\",\"Course 4\")))","v":"Course 1"},{"$f":"IF(COUNTIF(Général!B42:K42,$G$1)=1,\"Course 1\",IF(COUNTIF(Général!B44:K44,$G$1)=1,\"Course 2\",IF(COUNTIF(Général!#REF!,$G$1)=1,\"Course 3\",\"Course 4\")))","v":"Course 1"},{"$f":"IF(COUNTIF(Général!B50:K50,$G$1)=1,\"Course 1\",IF(COUNTIF(Général!B52:K52,$G$1)=1,\"Course 2\",IF(COUNTIF(Général!#REF!,$G$1)=1,\"Course 3\",\"Course 4\")))","v":"Course 1"},{"$f":"IF(COUNTIF(Général!B58:K58,$G$1)=1,\"Course 1\",IF(COUNTIF(Général!B60:K60,$G$1)=1,\"Course 2\",IF(COUNTIF(Général!#REF!,$G$1)=1,\"Course 3\",\"Course 4\")))","v":"Course 1"},{"$f":"IF(COUNTIF(Général!B66:K66,$G$1)=1,\"Course 1\",IF(COUNTIF(Général!B68:K68,$G$1)=1,\"Course 2\",IF(COUNTIF(Général!#REF!,$G$1)=1,\"Course 3\",\"Course 4\")))","v":"Course 2"},{"$f":"IF(COUNTIF(Général!B74:K74,$G$1)=1,\"Course 1\",IF(COUNTIF(Général!B76:K76,$G$1)=1,\"Course 2\",IF(COUNTIF(Général!#REF!,$G$1)=1,\"Course 3\",\"Course 4\")))","v":"Course 2"},{"$f":"IF(COUNTIF(Général!B82:K82,$G$1)=1,\"Course 1\",IF(COUNTIF(Général!B84:K84,$G$1)=1,\"Course 2\",IF(COUNTIF(Général!#REF!,$G$1)=1,\"Course 3\",\"Course 4\")))","v":"Course 1"},{"$f":"IF(COUNTIF(Général!B90:K90,$G$1)=1,\"Course 1\",IF(COUNTIF(Général!B92:K92,$G$1)=1,\"Course 2\",IF(COUNTIF(Général!#REF!,$G$1)=1,\"Course 3\",\"Course 4\")))","v":"Course 2"},{"$f":"IF(COUNTIF(Général!B98:K98,$G$1)=1,\"Course 1\",IF(COUNTIF(Général!B100:K100,$G$1)=1,\"Course 2\",IF(COUNTIF(Général!#REF!,$G$1)=1,\"Course 3\",\"Course 4\")))","v":"Course 2"},{"$f":"IF(COUNTIF(Général!B106:K106,$G$1)=1,\"Course 1\",IF(COUNTIF(Général!B108:K108,$G$1)=1,\"Course 2\",IF(COUNTIF(Général!#REF!,$G$1)=1,\"Course 3\",\"Course 4\")))","v":"Course 2"},{"$f":"IF(COUNTIF(Général!B114:K114,$G$1)=1,\"Course 1\",IF(COUNTIF(Général!B116:K116,$G$1)=1,\"Course 2\",IF(COUNTIF(Général!#REF!,$G$1)=1,\"Course 3\",\"Course 4\")))","v":"Course 2"},{"$f":"IF(COUNTIF(Général!B122:K122,$G$1)=1,\"Course 1\",IF(COUNTIF(Général!B124:K124,$G$1)=1,\"Course 2\",IF(COUNTIF(Général!#REF!,$G$1)=1,\"Course 3\",\"Course 4\")))","v":"Course 1"},{"$f":"IF(COUNTIF(Général!B130:K130,$G$1)=1,\"Course 1\",IF(COUNTIF(Général!B132:K132,$G$1)=1,\"Course 2\",IF(COUNTIF(Général!#REF!,$G$1)=1,\"Course 3\",\"Course 4\")))","v":"Course 2"},{"$f":"IF(COUNTIF(Général!B138:K138,$G$1)=1,\"Course 1\",IF(COUNTIF(Général!B140:K140,$G$1)=1,\"Course 2\",IF(COUNTIF(Général!#REF!,$G$1)=1,\"Course 3\",\"Course 4\")))","v":"Course 2"},{"$f":"IF(COUNTIF(Général!B146:K146,$G$1)=1,\"Course 1\",IF(COUNTIF(Général!B148:K148,$G$1)=1,\"Course 2\",IF(COUNTIF(Général!#REF!,$G$1)=1,\"Course 3\",\"Course 4\")))","v":"Course 2"},{"$f":"IF(COUNTIF(Général!B154:K154,$G$1)=1,\"Course 1\",IF(COUNTIF(Général!B156:K156,$G$1)=1,\"Course 2\",IF(COUNTIF(Général!B158:K158,$G$1)=1,\"Course 3\",\"Course 4\")))","v":"Course 1"},{"$f":"IF(COUNTIF(Général!C154:L154,$G$1)=1,\"Course 1\",IF(COUNTIF(Général!C156:L156,$G$1)=1,\"Course 2\",IF(COUNTIF(Général!C158:L158,$G$1)=1,\"Course 3\",\"Course 4\")))","v":"Course 1"},{"$f":"IF(COUNTIF(Général!D154:M154,$G$1)=1,\"Course 1\",IF(COUNTIF(Général!D156:M156,$G$1)=1,\"Course 2\",IF(COUNTIF(Général!D158:M158,$G$1)=1,\"Course 3\",\"Course 4\")))","v":"Course 1"},null,{"$f":"Général!B7","v":"Equipage 5"},6]
["Bateau",null,{"$f":"IF(COUNTIF(Général!B34:B38,$G$1)=1,\"Boat 1\",IF(COUNTIF(Général!C34:C38,$G$1)=1,\"Boat 2\",IF(COUNTIF(Général!D34:D38,$G$1)=1,\"Boat 3\",IF(COUNTIF(Général!E34:E38,$G$1)=1,\"Boat 4\",IF(COUNTIF(Général!F34:F38,$G$1)=1,\"Boat 5\",IF(COUNTIF(Général!G34:G38,$G$1)=1,\"Boat 6\",IF(COUNTIF(Général!H34:H38,$G$1)=1,\"Boat 7\",IF(COUNTIF(Général!I34:I38,$G$1)=1,\"Boat 8\",IF(COUNTIF(Général!J34:J38,$G$1)=1,\"Boat 9\",\"Boat10\")))))))))","v":"Boat 2"},{"$f":"IF(COUNTIF(Général!B42:B46,$G$1)=1,\"Boat 1\",IF(COUNTIF(Général!C42:C46,$G$1)=1,\"Boat 2\",IF(COUNTIF(Général!D42:D46,$G$1)=1,\"Boat 3\",IF(COUNTIF(Général!E42:E46,$G$1)=1,\"Boat 4\",IF(COUNTIF(Général!F42:F46,$G$1)=1,\"Boat 5\",IF(COUNTIF(Général!G42:G46,$G$1)=1,\"Boat 6\",IF(COUNTIF(Général!H42:H46,$G$1)=1,\"Boat 7\",IF(COUNTIF(Général!I42:I46,$G$1)=1,\"Boat 8\",IF(COUNTIF(Général!J42:J46,$G$1)=1,\"Boat 9\",\"Boat 10\")))))))))","v":"Boat 4"},{"$f":"IF(COUNTIF(Général!B50:B54,$G$1)=1,\"Boat 1\",IF(COUNTIF(Général!C50:C54,$G$1)=1,\"Boat 2\",IF(COUNTIF(Général!D50:D54,$G$1)=1,\"Boat 3\", IF(COUNTIF(Général!E50:E54,$G$1)=1,\"Boat 4\", IF(COUNTIF(Général!F50:F54,$G$1)=1,\"Boat 5\", IF(COUNTIF(Général!G50:G54,$G$1)=1,\"Boat 6\", IF(COUNTIF(Général!H50:H54,$G$1)=1,\"Boat 7\",IF(COUNTIF(Général!I50:I54,$G$1)=1,\"Boat 8\",IF(COUNTIF(Général!J50:J54,$G$1)=1,\"Boat 9\",\"Boat 10\")))))))))","v":"Boat 4"},{"$f":"IF(COUNTIF(Général!B58:B62,$G$1)=1,\"Boat 1\",IF(COUNTIF(Général!C58:C62,$G$1)=1,\"Boat 2\",IF(COUNTIF(Général!D58:D62,$G$1)=1,\"Boat 3\", IF(COUNTIF(Général!E58:E62,$G$1)=1,\"Boat 4\", IF(COUNTIF(Général!F58:F62,$G$1)=1,\"Boat 5\", IF(COUNTIF(Général!G58:G62,$G$1)=1,\"Boat 6\", IF(COUNTIF(Général!H58:H62,$G$1)=1,\"Boat 7\",IF(COUNTIF(Général!I58:I62,$G$1)=1,\"Boat 8\",IF(COUNTIF(Général!I58:J62,$G$1)=1,\"Boat 9\",\"Boat 10\")))))))))","v":"Boat 1"},{"$f":"IF(COUNTIF(Général!B66:B70,$G$1)=1,\"Boat 1\",IF(COUNTIF(Général!C66:C70,$G$1)=1,\"Boat 2\",IF(COUNTIF(Général!D66:D70,$G$1)=1,\"Boat 3\", IF(COUNTIF(Général!E66:E70,$G$1)=1,\"Boat 4\", IF(COUNTIF(Général!F66:F70,$G$1)=1,\"Boat 5\", IF(COUNTIF(Général!G66:G70,$G$1)=1,\"Boat 6\", IF(COUNTIF(Général!H66:H70,$G$1)=1,\"Boat 7\",IF(COUNTIF(Général!I66:I70,$G$1)=1,\"Boat 8\",IF(COUNTIF(Général!J66:J70,$G$1)=1,\"Boat 9\",\"Boat 10\")))))))))","v":"Boat 2"},{"$f":"IF(COUNTIF(Général!B74:B78,$G$1)=1,\"Boat 1\",IF(COUNTIF(Général!C74:C78,$G$1)=1,\"Boat 2\",IF(COUNTIF(Général!D74:D78,$G$1)=1,\"Boat 3\", IF(COUNTIF(Général!E74:E78,$G$1)=1,\"Boat 4\", IF(COUNTIF(Général!F74:F78,$G$1)=1,\"Boat 5\", IF(COUNTIF(Général!G74:G78,$G$1)=1,\"Boat 6\", IF(COUNTIF(Général!H74:H78,$G$1)=1,\"Boat 7\",IF(COUNTIF(Général!I74:I78,$G$1)=1,\"Boat 8\",IF(COUNTIF(Général!J74:J78,$G$1)=1,\"Boat 9\",\"Boat 10\")))))))))","v":"Boat 4"},{"$f":"IF(COUNTIF(Général!B82:B86,$G$1)=1,\"Boat 1\",IF(COUNTIF(Général!C82:C86,$G$1)=1,\"Boat 2\",IF(COUNTIF(Général!D82:D86,$G$1)=1,\"Boat 3\", IF(COUNTIF(Général!E82:E86,$G$1)=1,\"Boat 4\", IF(COUNTIF(Général!F82:F86,$G$1)=1,\"Boat 5\", IF(COUNTIF(Général!G82:G86,$G$1)=1,\"Boat 6\", IF(COUNTIF(Général!H82:H86,$G$1)=1,\"Boat 7\",IF(COUNTIF(Général!I82:I86,$G$1)=1,\"Boat 8\",IF(COUNTIF(Général!J82:J86,$G$1)=1,\"Boat 9\",\"Boat 10\")))))))))","v":"Boat 4"},{"$f":"IF(COUNTIF(Général!B90:B94,$G$1)=1,\"Boat 1\",IF(COUNTIF(Général!C90:C94,$G$1)=1,\"Boat 2\",IF(COUNTIF(Général!D90:D94,$G$1)=1,\"Boat 3\", IF(COUNTIF(Général!E90:E94,$G$1)=1,\"Boat 4\", IF(COUNTIF(Général!F90:F94,$G$1)=1,\"Boat 5\", IF(COUNTIF(Général!G90:G94,$G$1)=1,\"Boat 6\", IF(COUNTIF(Général!H90:H94,$G$1)=1,\"Boat 7\",IF(COUNTIF(Général!I90:I94,$G$1)=1,\"Boat 8\",IF(COUNTIF(Général!J90:J94,$G$1)=1,\"Boat 9\",\"Boat 10\")))))))))","v":"Boat 1"},{"$f":"IF(COUNTIF(Général!B98:B102,$G$1)=1,\"Boat 1\",IF(COUNTIF(Général!C98:C102,$G$1)=1,\"Boat 2\",IF(COUNTIF(Général!D98:D102,$G$1)=1,\"Boat 3\", IF(COUNTIF(Général!E98:E102,$G$1)=1,\"Boat 4\", IF(COUNTIF(Général!F98:F102,$G$1)=1,\"Boat 5\", IF(COUNTIF(Général!G98:G102,$G$1)=1,\"Boat 6\", IF(COUNTIF(Général!H98:H102,$G$1)=1,\"Boat 7\",IF(COUNTIF(Général!I98:I102,$G$1)=1,\"Boat 8\",IF(COUNTIF(Général!J98:J102,$G$1)=1,\"Boat 9\",\"Boat 10\")))))))))","v":"Boat 5"},{"$f":"IF(COUNTIF(Général!B106:B110,$G$1)=1,\"Boat 1\",IF(COUNTIF(Général!C106:C110,$G$1)=1,\"Boat 2\",IF(COUNTIF(Général!D106:D110,$G$1)=1,\"Boat 3\", IF(COUNTIF(Général!E106:E110,$G$1)=1,\"Boat 4\", IF(COUNTIF(Général!F106:F110,$G$1)=1,\"Boat 5\", IF(COUNTIF(Général!G106:G110,$G$1)=1,\"Boat 6\", IF(COUNTIF(Général!H106:H110,$G$1)=1,\"Boat 7\",IF(COUNTIF(Général!I106:I110,$G$1)=1,\"Boat 8\",IF(COUNTIF(Général!J106:J110,$G$1)=1,\"Boat 9\",\"Boat 10\")))))))))","v":"Boat 1"},{"$f":"IF(COUNTIF(Général!B114:B118,$G$1)=1,\"Boat 1\",IF(COUNTIF(Général!C114:C118,$G$1)=1,\"Boat 2\",IF(COUNTIF(Général!C114:D118,$G$1)=1,\"Boat 3\", IF(COUNTIF(Général!C114:E118,$G$1)=1,\"Boat 4\", IF(COUNTIF(Général!F114:F118,$G$1)=1,\"Boat 5\", IF(COUNTIF(Général!G114:G118,$G$1)=1,\"Boat 6\", IF(COUNTIF(Général!H114:H118,$G$1)=1,\"Boat 7\",IF(COUNTIF(Général!I114:I118,$G$1)=1,\"Boat 8\",IF(COUNTIF(Général!J114:J118,$G$1)=1,\"Boat 9\",\"Boat 10\")))))))))","v":"Boat 3"},{"$f":"IF(COUNTIF(Général!B122:B126,$G$1)=1,\"Boat 1\",IF(COUNTIF(Général!C122:C126,$G$1)=1,\"Boat 2\",IF(COUNTIF(Général!D122:D126,$G$1)=1,\"Boat 3\", IF(COUNTIF(Général!E122:E126,$G$1)=1,\"Boat 4\", IF(COUNTIF(Général!F122:F126,$G$1)=1,\"Boat 5\", IF(COUNTIF(Général!G122:G126,$G$1)=1,\"Boat 6\", IF(COUNTIF(Général!H122:H126,$G$1)=1,\"Boat 7\",IF(COUNTIF(Général!I122:I126,$G$1)=1,\"Boat 8\",IF(COUNTIF(Général!J122:J126,$G$1)=1,\"Boat 9\",\"Boat 10\")))))))))","v":"Boat 3"},{"$f":"IF(COUNTIF(Général!B130:B134,$G$1)=1,\"Boat 1\",IF(COUNTIF(Général!C130:C134,$G$1)=1,\"Boat 2\",IF(COUNTIF(Général!D130:D134,$G$1)=1,\"Boat 3\", IF(COUNTIF(Général!E130:E134,$G$1)=1,\"Boat 4\", IF(COUNTIF(Général!F130:F134,$G$1)=1,\"Boat 5\", IF(COUNTIF(Général!G130:G134,$G$1)=1,\"Boat 6\", IF(COUNTIF(Général!H130:H134,$G$1)=1,\"Boat 7\",IF(COUNTIF(Général!I130:I134,$G$1)=1,\"Boat 8\",IF(COUNTIF(Général!J130:J134,$G$1)=1,\"Boat 9\",\"Boat 10\")))))))))","v":"Boat 5"},{"$f":"IF(COUNTIF(Général!B138:B142,$G$1)=1,\"Boat 1\",IF(COUNTIF(Général!C138:C142,$G$1)=1,\"Boat 2\",IF(COUNTIF(Général!D138:D142,$G$1)=1,\"Boat 3\", IF(COUNTIF(Général!E138:E142,$G$1)=1,\"Boat 4\", IF(COUNTIF(Général!F138:F142,$G$1)=1,\"Boat 5\", IF(COUNTIF(Général!G138:G142,$G$1)=1,\"Boat 6\", IF(COUNTIF(Général!H138:H142,$G$1)=1,\"Boat 7\",IF(COUNTIF(Général!I138:I142,$G$1)=1,\"Boat 8\",IF(COUNTIF(Général!J138:J142,$G$1)=1,\"Boat 9\",\"Boat 10\")))))))))","v":"Boat 3"},{"$f":"IF(COUNTIF(Général!B146:B150,$G$1)=1,\"Boat 1\",IF(COUNTIF(Général!C146:C150,$G$1)=1,\"Boat 2\",IF(COUNTIF(Général!D146:D150,$G$1)=1,\"Boat 3\", IF(COUNTIF(Général!E146:E150,$G$1)=1,\"Boat 4\", IF(COUNTIF(Général!F146:F150,$G$1)=1,\"Boat 5\", IF(COUNTIF(Général!G146:G150,$G$1)=1,\"Boat 6\", IF(COUNTIF(Général!H146:H150,$G$1)=1,\"Boat 7\",IF(COUNTIF(Général!I146:I150,$G$1)=1,\"Boat 8\",IF(COUNTIF(Général!J146:J150,$G$1)=1,\"Boat 9\",\"Boat 10\")))))))))","v":"Boat 3"},{"$f":"IF(COUNTIF(Général!B154:B157,$G$1)=1,\"Boat 1\",IF(COUNTIF(Général!C154:C157,$G$1)=1,\"Boat 2\",IF(COUNTIF(Général!D154:D157,$G$1)=1,\"Boat 3\", IF(COUNTIF(Général!E154:E157,$G$1)=1,\"Boat 4\", IF(COUNTIF(Général!F154:F157,$G$1)=1,\"Boat 5\", IF(COUNTIF(Général!G154:G157,$G$1)=1,\"Boat 6\", IF(COUNTIF(Général!H154:H157,$G$1)=1,\"Boat 7\",IF(COUNTIF(Général!I154:I157,$G$1)=1,\"Boat 8\",IF(COUNTIF(Général!J154:J157,$G$1)=1,\"Boat 9\",\"Boat 10\")))))))))","v":"Boat 3"},{"$f":"IF(COUNTIF(Général!B160:B163,$G$1)=1,\"Boat 1\",IF(COUNTIF(Général!C160:C163,$G$1)=1,\"Boat 2\",IF(COUNTIF(Général!D160:D163,$G$1)=1,\"Boat 3\", IF(COUNTIF(Général!E160:E163,$G$1)=1,\"Boat 4\", IF(COUNTIF(Général!F160:F163,$G$1)=1,\"Boat 5\", IF(COUNTIF(Général!G160:G163,$G$1)=1,\"Boat 6\", IF(COUNTIF(Général!H160:H163,$G$1)=1,\"Boat 7\",IF(COUNTIF(Général!I160:I163,$G$1)=1,\"Boat 8\",IF(COUNTIF(Général!J160:J163,$G$1)=1,\"Boat 9\",\"Boat 10\")))))))))","v":"Boat 3"},{"$f":"IF(COUNTIF(Général!B166:B169,$G$1)=1,\"Boat 1\",IF(COUNTIF(Général!C166:C169,$G$1)=1,\"Boat 2\",IF(COUNTIF(Général!D166:D169,$G$1)=1,\"Boat 3\", IF(COUNTIF(Général!E166:E169,$G$1)=1,\"Boat 4\", IF(COUNTIF(Général!F166:F169,$G$1)=1,\"Boat 5\", IF(COUNTIF(Général!G166:G169,$G$1)=1,\"Boat 6\", IF(COUNTIF(Général!H166:H169,$G$1)=1,\"Boat 7\",IF(COUNTIF(Général!I166:I169,$G$1)=1,\"Boat 8\",IF(COUNTIF(Général!J166:J169,$G$1)=1,\"Boat 9\",\"Boat 10\")))))))))","v":"Boat 3"},null,{"$f":"Général!B8","v":"Equipage 6"},7]
[null,null,null,null,null,null,null,null,null,null,null,null,null,null,null,null,null,null,null,null,null,{"$f":"Général!B9","v":"Equipage 7"},10]
["1er Equipage",null,{"$f":"IF($C$5=\"Course 1\",Général!B34,IF($C$5=\"Course 2\",Général!B36,IF($C$5=\"Course 3\",Général!#REF!,Général!B38)))","v":"Equipage 7"},{"$f":"IF($D$5=\"Course 1\",Général!B42,IF($D$5=\"Course 2\",Général!B44,IF($D$5=\"Course 3\",Général!#REF!,Général!B46)))","v":"Equipage 8"},{"$f":"IF($E$5=\"Course 1\",Général!B50,IF($E$5=\"Course 2\",Général!B52,IF($E$5=\"Course 3\",Général!#REF!,Général!B54)))","v":"Equipage 5"},{"$f":"IF($F$5=\"Course 1\",Général!B$58,IF($F$5=\"Course 2\",Général!B$60,IF($F$5=\"Course 3\",Général!#REF!,Général!B$62)))","v":"Equipage 10"},{"$f":"IF($G$5=\"Course 1\",Général!B$66,IF($G$5=\"Course 2\",Général!B$68,IF($G$5=\"Course 3\",Général!#REF!,Général!B$70)))","v":"Equipage 4"},{"$f":"IF($H$5=\"Course 1\",Général!B$74,IF($H$5=\"Course 2\",Général!B$76,IF($H$5=\"Course 3\",Général!#REF!,Général!B$78)))","v":"Equipage 4"},{"$f":"IF($I$5=\"Course 1\",Général!B$82,IF($I$5=\"Course 2\",Général!B$84,IF($I$5=\"Course 3\",Général!#REF!,Général!B$86)))","v":"Equipage 4"},{"$f":"IF($J$5=\"Course 1\",Général!B$90,IF($J$5=\"Course 2\",Général!B$92,IF($J$5=\"Course 3\",Général!#REF!,Général!B$94)))","v":"Equipage 10"},{"$f":"IF($K$5=\"Course 1\",Général!B$98,IF($K$5=\"Course 2\",Général!B$100,IF($K$5=\"Course 3\",Général!#REF!,Général!B$102)))","v":"Equipage 3"},{"$f":"IF($L$5=\"Course 1\",Général!B$106,IF($L$5=\"Course 2\",Général!B$108,IF($L$5=\"Course 3\",Général!#REF!,Général!B$110)))","v":"Equipage 10"},{"$f":"IF($M$5=\"Course 1\",Général!B$114,IF($M$5=\"Course 2\",Général!B$116,IF($M$5=\"Course 3\",Général!#REF!,Général!B$118)))","v":"Equipage 1"},{"$f":"IF($N$5=\"Course 1\",Général!B$122,IF($N$5=\"Course 2\",Général!B$124,IF($N$5=\"Course 3\",Général!#REF!,Général!B$126)))","v":"Equipage 9"},{"$f":"IF($O$5=\"Course 1\",Général!B$130,IF($O$5=\"Course 2\",Général!B$132,IF($O$5=\"Course 3\",Général!#REF!,Général!B$134)))","v":"Equipage 4"},{"$f":"IF($P$5=\"Course 1\",Général!B$138,IF($P$5=\"Course 2\",Général!B$140,IF($P$5=\"Course 3\",Général!#REF!,Général!B$142)))","v":"Equipage 7"},{"$f":"IF($Q$5=\"Course 1\",Général!B$146,IF($Q$5=\"Course 2\",Général!B$148,IF($Q$5=\"Course 3\",Général!#REF!,Général!B$150)))","v":"Equipage 9"},{"$f":"IF($R$5=\"Course 1\",Général!B$154,IF($R$5=\"Course 2\",Général!B$156,IF($R$5=\"Course 3\",Général!B$158,Général!B$160)))","v":"Equipage 1"},null,null,null,{"$f":"Général!B10","v":"Equipage 8"},8]
["2nd Equipage",null,{"$f":"IF($C$5=\"Course 1\",Général!C34,IF($C$5=\"Course 2\",Général!C36,IF($C$5=\"Course 3\",Général!#REF!,Général!C38)))","v":"Equipage 10"},{"$f":"IF($D$5=\"Course 1\",Général!C42,IF($D$5=\"Course 2\",Général!C44,IF($D$5=\"Course 3\",Général!#REF!,Général!C46)))","v":"Equipage 4"},{"$f":"IF($E$5=\"Course 1\",Général!C50,IF($E$5=\"Course 2\",Général!C52,IF($E$5=\"Course 3\",Général!#REF!,Général!C54)))","v":"Equipage 8"},{"$f":"IF($F$5=\"Course 1\",Général!C$58,IF($F$5=\"Course 2\",Général!C$60,IF($F$5=\"Course 3\",Général!#REF!,Général!C$62)))","v":"Equipage 7"},{"$f":"IF($G$5=\"Course 1\",Général!C$66,IF($G$5=\"Course 2\",Général!C$68,IF($G$5=\"Course 3\",Général!#REF!,Général!C$70)))","v":"Equipage 10"},{"$f":"IF($H$5=\"Course 1\",Général!C$74,IF($H$5=\"Course 2\",Général!C$76,IF($H$5=\"Course 3\",Général!#REF!,Général!C$78)))","v":"Equipage 8"},{"$f":"IF($I$5=\"Course 1\",Général!C$82,IF($I$5=\"Course 2\",Général!C$84,IF($I$5=\"Course 3\",Général!#REF!,Général!C$86)))","v":"Equipage 8"},{"$f":"IF($J$5=\"Course 1\",Général!C$90,IF($J$5=\"Course 2\",Général!C$92,IF($J$5=\"Course 3\",Général!#REF!,Général!C$94)))","v":"Equipage 1"},{"$f":"IF($K$5=\"Course 1\",Général!C$98,IF($K$5=\"Course 2\",Général!C$100,IF($K$5=\"Course 3\",Général!#REF!,Général!C$102)))","v":"Equipage 8"},{"$f":"IF($L$5=\"Course 1\",Général!C$106,IF($L$5=\"Course 2\",Général!C$108,IF($L$5=\"Course 3\",Général!#REF!,Général!C$110)))","v":"Equipage 4"},{"$f":"IF($M$5=\"Course 1\",Général!C$114,IF($M$5=\"Course 2\",Général!C$116,IF($M$5=\"Course 3\",Général!#REF!,Général!C$118)))","v":"Equipage 7"},{"$f":"IF($N$5=\"Course 1\",Général!C$122,IF($N$5=\"Course 2\",Général!C$124,IF($N$5=\"Course 3\",Général!#REF!,Général!C$126)))","v":"Equipage 6"},{"$f":"IF($O$5=\"Course 1\",Général!C$130,IF($O$5=\"Course 2\",Général!C$132,IF($O$5=\"Course 3\",Général!#REF!,Général!C$134)))","v":"Equipage 7"},{"$f":"IF($P$5=\"Course 1\",Général!C$138,IF($P$5=\"Course 2\",Général!C$140,IF($P$5=\"Course 3\",Général!#REF!,Général!C$142)))","v":"Equipage 1"},{"$f":"IF($Q$5=\"Course 1\",Général!C$146,IF($Q$5=\"Course 2\",Général!C$148,IF($Q$5=\"Course 3\",Général!#REF!,Général!C$150)))","v":"Equipage 7"},{"$f":"IF($R$5=\"Course 1\",Général!C$154,IF($R$5=\"Course 2\",Général!C$156,IF($R$5=\"Course 3\",Général!C$158,Général!C$160)))","v":"Equipage 7"},null,null,null,{"$f":"Général!B11","v":"Equipage 9"},6]
["3ème Equipage",null,{"$f":"IF($C$5=\"Course 1\",Général!D34,IF($C$5=\"Course 2\",Général!D36,IF($C$5=\"Course 3\",Général!#REF!,Général!D38)))","v":"Equipage 4"},{"$f":"IF($D$5=\"Course 1\",Général!D42,IF($D$5=\"Course 2\",Général!D44,IF($D$5=\"Course 3\",Général!#REF!,Général!D46)))","v":"Equipage 9"},{"$f":"IF($E$5=\"Course 1\",Général!D50,IF($E$5=\"Course 2\",Général!D52,IF($E$5=\"Course 3\",Général!#REF!,Général!D54)))","v":"Equipage 4"},{"$f":"IF($F$5=\"Course 1\",Général!D$58,IF($F$5=\"Course 2\",Général!D$60,IF($F$5=\"Course 3\",Général!#REF!,Général!D$62)))","v":"Equipage 3"},{"$f":"IF($G$5=\"Course 1\",Général!D$66,IF($G$5=\"Course 2\",Général!D$68,IF($G$5=\"Course 3\",Général!#REF!,Général!D$70)))","v":"Equipage 8"},{"$f":"IF($H$5=\"Course 1\",Général!D$74,IF($H$5=\"Course 2\",Général!D$76,IF($H$5=\"Course 3\",Général!#REF!,Général!D$78)))","v":"Equipage 9"},{"$f":"IF($I$5=\"Course 1\",Général!D$82,IF($I$5=\"Course 2\",Général!D$84,IF($I$5=\"Course 3\",Général!#REF!,Général!D$86)))","v":"Equipage 7"},{"$f":"IF($J$5=\"Course 1\",Général!D$90,IF($J$5=\"Course 2\",Général!D$92,IF($J$5=\"Course 3\",Général!#REF!,Général!D$94)))","v":"Equipage 3"},{"$f":"IF($K$5=\"Course 1\",Général!D$98,IF($K$5=\"Course 2\",Général!D$100,IF($K$5=\"Course 3\",Général!#REF!,Général!D$102)))","v":"Equipage 5"},{"$f":"IF($L$5=\"Course 1\",Général!D$106,IF($L$5=\"Course 2\",Général!D$108,IF($L$5=\"Course 3\",Général!#REF!,Général!D$110)))","v":"Equipage 1"},{"$f":"IF($M$5=\"Course 1\",Général!D$114,IF($M$5=\"Course 2\",Général!D$116,IF($M$5=\"Course 3\",Général!#REF!,Général!D$118)))","v":"Equipage 10"},{"$f":"IF($N$5=\"Course 1\",Général!D$122,IF($N$5=\"Course 2\",Général!D$124,IF($N$5=\"Course 3\",Général!#REF!,Général!D$126)))","v":"Equipage 10"},{"$f":"IF($O$5=\"Course 1\",Général!D$130,IF($O$5=\"Course 2\",Général!D$132,IF($O$5=\"Course 3\",Général!#REF!,Général!D$134)))","v":"Equipage 6"},{"$f":"IF($P$5=\"Course 1\",Général!D$138,IF($P$5=\"Course 2\",Général!D$140,IF($P$5=\"Course 3\",Général!#REF!,Général!D$142)))","v":"Equipage 10"},{"$f":"IF($Q$5=\"Course 1\",Général!D$146,IF($Q$5=\"Course 2\",Général!D$148,IF($Q$5=\"Course 3\",Général!#REF!,Général!D$150)))","v":"Equipage 10"},{"$f":"IF($R$5=\"Course 1\",Général!D$154,IF($R$5=\"Course 2\",Général!D$156,IF($R$5=\"Course 3\",Général!D$158,Général!D$160)))","v":"Equipage 10"},null,null,null,{"$f":"Général!B12","v":"Equipage 10"},16]
["4ème Equipage",null,{"$f":"IF($C$5=\"Course 1\",Général!E34,IF($C$5=\"Course 2\",Général!E36,IF($C$5=\"Course 3\",Général!#REF!,Général!E38)))","v":"Equipage 6"},{"$f":"IF($D$5=\"Course 1\",Général!E42,IF($D$5=\"Course 2\",Général!E44,IF($D$5=\"Course 3\",Général!#REF!,Général!E46)))","v":"Equipage 10"},{"$f":"IF($E$5=\"Course 1\",Général!E50,IF($E$5=\"Course 2\",Général!E52,IF($E$5=\"Course 3\",Général!#REF!,Général!E54)))","v":"Equipage 10"},{"$f":"IF($F$5=\"Course 1\",Général!E$58,IF($F$5=\"Course 2\",Général!E$60,IF($F$5=\"Course 3\",Général!#REF!,Général!E$62)))","v":"Equipage 9"},{"$f":"IF($G$5=\"Course 1\",Général!E$66,IF($G$5=\"Course 2\",Général!E$68,IF($G$5=\"Course 3\",Général!#REF!,Général!E$70)))","v":"Equipage 5"},{"$f":"IF($H$5=\"Course 1\",Général!E$74,IF($H$5=\"Course 2\",Général!E$76,IF($H$5=\"Course 3\",Général!#REF!,Général!E$78)))","v":"Equipage 10"},{"$f":"IF($I$5=\"Course 1\",Général!E$82,IF($I$5=\"Course 2\",Général!E$84,IF($I$5=\"Course 3\",Général!#REF!,Général!E$86)))","v":"Equipage 10"},{"$f":"IF($J$5=\"Course 1\",Général!E$90,IF($J$5=\"Course 2\",Général!E$92,IF($J$5=\"Course 3\",Général!#REF!,Général!E$94)))","v":"Equipage 2"},{"$f":"IF($K$5=\"Course 1\",Général!E$98,IF($K$5=\"Course 2\",Général!E$100,IF($K$5=\"Course 3\",Général!#REF!,Général!E$102)))","v":"Equipage 7"},{"$f":"IF($L$5=\"Course 1\",Général!E$106,IF($L$5=\"Course 2\",Général!E$108,IF($L$5=\"Course 3\",Général!#REF!,Général!E$110)))","v":"Equipage 8"},{"$f":"IF($M$5=\"Course 1\",Général!E$114,IF($M$5=\"Course 2\",Général!E$116,IF($M$5=\"Course 3\",Général!#REF!,Général!E$118)))","v":"Equipage 4"},{"$f":"IF($N$5=\"Course 1\",Général!E$122,IF($N$5=\"Course 2\",Général!E$124,IF($N$5=\"Course 3\",Général!#REF!,Général!E$126)))","v":"Equipage 2"},{"$f":"IF($O$5=\"Course 1\",Général!E$130,IF($O$5=\"Course 2\",Général!E$132,IF($O$5=\"Course 3\",Général!#REF!,Général!E$134)))","v":"Equipage 5"},{"$f":"IF($P$5=\"Course 1\",Général!E$138,IF($P$5=\"Course 2\",Général!E$140,IF($P$5=\"Course 3\",Général!#REF!,Général!E$142)))","v":"Equipage 4"},{"$f":"IF($Q$5=\"Course 1\",Général!E$146,IF($Q$5=\"Course 2\",Général!E$148,IF($Q$5=\"Course 3\",Général!#REF!,Général!E$150)))","v":"Equipage 6"},{"$f":"IF($R$5=\"Course 1\",Général!E$154,IF($R$5=\"Course 2\",Général!E$156,IF($R$5=\"Course 3\",Général!E$158,Général!E$160)))","v":"Equipage 6"}]
["5ème Equipage",null,{"$f":"IF($C$5=\"Course 1\",Général!F34,IF($C$5=\"Course 2\",Général!F36,IF($C$5=\"Course 3\",Général!#REF!,Général!F38)))","v":"Equipage 1"},{"$f":"IF($D$5=\"Course 1\",Général!F42,IF($D$5=\"Course 2\",Général!F44,IF($D$5=\"Course 3\",Général!#REF!,Général!F46)))","v":"Equipage 6"},{"$f":"IF($E$5=\"Course 1\",Général!F50,IF($E$5=\"Course 2\",Général!F52,IF($E$5=\"Course 3\",Général!#REF!,Général!F54)))","v":"Equipage 7"},{"$f":"IF($F$5=\"Course 1\",Général!F$58,IF($F$5=\"Course 2\",Général!F$60,IF($F$5=\"Course 3\",Général!#REF!,Général!F$62)))","v":"Equipage 6"},{"$f":"IF($G$5=\"Course 1\",Général!F$66,IF($G$5=\"Course 2\",Général!F$68,IF($G$5=\"Course 3\",Général!#REF!,Général!F$70)))","v":"Equipage 1"},{"$f":"IF($H$5=\"Course 1\",Général!F$74,IF($H$5=\"Course 2\",Général!F$76,IF($H$5=\"Course 3\",Général!#REF!,Général!F$78)))","v":"Equipage 5"},{"$f":"IF($I$5=\"Course 1\",Général!F$82,IF($I$5=\"Course 2\",Général!F$84,IF($I$5=\"Course 3\",Général!#REF!,Général!F$86)))","v":"Equipage 5"},{"$f":"IF($J$5=\"Course 1\",Général!F$90,IF($J$5=\"Course 2\",Général!F$92,IF($J$5=\"Course 3\",Général!#REF!,Général!F$94)))","v":"Equipage 8"},{"$f":"IF($K$5=\"Course 1\",Général!F$98,IF($K$5=\"Course 2\",Général!F$100,IF($K$5=\"Course 3\",Général!#REF!,Général!F$102)))","v":"Equipage 10"},{"$f":"IF($L$5=\"Course 1\",Général!F$106,IF($L$5=\"Course 2\",Général!$F108,IF($L$5=\"Course 3\",Général!#REF!,Général!F$110)))","v":"Equipage 9"},{"$f":"IF($M$5=\"Course 1\",Général!F$114,IF($M$5=\"Course 2\",Général!F$116,IF($M$5=\"Course 3\",Général!#REF!,Général!F$118)))","v":"Equipage 3"},{"$f":"IF($N$5=\"Course 1\",Général!F$122,IF($N$5=\"Course 2\",Général!F$124,IF($N$5=\"Course 3\",Général!#REF!,Général!F$126)))","v":"Equipage 3"},{"$f":"IF($O$5=\"Course 1\",Général!F$130,IF($O$5=\"Course 2\",Général!F$132,IF($O$5=\"Course 3\",Général!#REF!,Général!F$134)))","v":"Equipage 10"},{"$f":"IF($P$5=\"Course 1\",Général!F$138,IF($P$5=\"Course 2\",Général!F$140,IF($P$5=\"Course 3\",Général!#REF!,Général!F$142)))","v":"Equipage 3"},{"$f":"IF($Q$5=\"Course 1\",Général!F$146,IF($Q$5=\"Course 2\",Général!F$148,IF($Q$5=\"Course 3\",Général!#REF!,Général!F$150)))","v":"Equipage 3"},{"$f":"IF($R$5=\"Course 1\",Général!F$154,IF($R$5=\"Course 2\",Général!F$156,IF($R$5=\"Course 3\",Général!F$158,Général!F$160)))","v":"Equipage 4"}]
["7ème Equipage",null,{"$f":"IF($C$5=\"Course 1\",Général!H34,IF($C$5=\"Course 2\",Général!H36,IF($C$5=\"Course 3\",Général!#REF!,Général!H38)))","v":0},{"$f":"IF($D$5=\"Course 1\",Général!H42,IF($D$5=\"Course 2\",Général!H44,IF($D$5=\"Course 3\",Général!#REF!,Général!H46)))","v":0},{"$f":"IF($E$5=\"Course 1\",Général!H50,IF($E$5=\"Course 2\",Général!H52,IF($E$5=\"Course 3\",Général!#REF!,Général!H54)))","v":0},{"$f":"IF($F$5=\"Course 1\",Général!H$58,IF($F$5=\"Course 2\",Général!H$60,IF($F$5=\"Course 3\",Général!#REF!,Général!H$62)))","v":0},{"$f":"IF($G$5=\"Course 1\",Général!H$66,IF($G$5=\"Course 2\",Général!H$68,IF($G$5=\"Course 3\",Général!#REF!,Général!H$70)))","v":0},{"$f":"IF($H$5=\"Course 1\",Général!H$74,IF($H$5=\"Course 2\",Général!H$76,IF($H$5=\"Course 3\",Général!#REF!,Général!H$78)))","v":0},{"$f":"IF($I$5=\"Course 1\",Général!H$82,IF($I$5=\"Course 2\",Général!H$84,IF($I$5=\"Course 3\",Général!#REF!,Général!H$86)))","v":0},{"$f":"IF($J$5=\"Course 1\",Général!H$90,IF($J$5=\"Course 2\",Général!H$92,IF($J$5=\"Course 3\",Général!#REF!,Général!H$94)))","v":0},{"$f":"IF($K$5=\"Course 1\",Général!H$98,IF($K$5=\"Course 2\",Général!H$100,IF($K$5=\"Course 3\",Général!#REF!,Général!H$102)))","v":0},{"$f":"IF($L$5=\"Course 1\",Général!H$106,IF($L$5=\"Course 2\",Général!H$108,IF($L$5=\"Course 3\",Général!#REF!,Général!H$110)))","v":0},{"$f":"IF($M$5=\"Course 1\",Général!H$114,IF($M$5=\"Course 2\",Général!H$116,IF($M$5=\"Course 3\",Général!#REF!,Général!H$118)))","v":0},{"$f":"IF($N$5=\"Course 1\",Général!H$122,IF($N$5=\"Course 2\",Général!H$124,IF($N$5=\"Course 3\",Général!#REF!,Général!H$126)))","v":0},{"$f":"IF($O$5=\"Course 1\",Général!H$130,IF($O$5=\"Course 2\",Général!H$132,IF($O$5=\"Course 3\",Général!#REF!,Général!H$134)))","v":0},{"$f":"IF($P$5=\"Course 1\",Général!H$138,IF($P$5=\"Course 2\",Général!H$140,IF($P$5=\"Course 3\",Général!#REF!,Général!H$142)))","v":0},{"$f":"IF($Q$5=\"Course 1\",Général!H$146,IF($Q$5=\"Course 2\",Général!H$148,IF($Q$5=\"Course 3\",Général!#REF!,Général!H$150)))","v":0},{"$f":"IF($R$5=\"Course 1\",Général!H$154,IF($R$5=\"Course 2\",Général!H$156,IF($R$5=\"Course 3\",Général!H$158,Général!H$160)))","v":0},null,null,null,{"$f":"Général!B14","v":"Equipage 14"},{"$f":"COUNTIF($C$8:$R$16,V13)","v":0}]
["8ème Equipage",null,{"$f":"IF($C$5=\"Course 1\",Général!I34,IF($C$5=\"Course 2\",Général!I36,IF($C$5=\"Course 3\",Général!#REF!,Général!I38)))","v":0},{"$f":"IF($D$5=\"Course 1\",Général!I42,IF($D$5=\"Course 2\",Général!I44,IF($D$5=\"Course 3\",Général!#REF!,Général!I46)))","v":0},{"$f":"IF($E$5=\"Course 1\",Général!I50,IF($E$5=\"Course 2\",Général!I52,IF($E$5=\"Course 3\",Général!#REF!,Général!I54)))","v":0},{"$f":"IF($F$5=\"Course 1\",Général!I$58,IF($F$5=\"Course 2\",Général!I$60,IF($F$5=\"Course 3\",Général!#REF!,Général!I$62)))","v":0},{"$f":"IF($G$5=\"Course 1\",Général!I$66,IF($G$5=\"Course 2\",Général!I$68,IF($G$5=\"Course 3\",Général!#REF!,Général!I$70)))","v":0},{"$f":"IF($H$5=\"Course 1\",Général!I$74,IF($H$5=\"Course 2\",Général!I$76,IF($H$5=\"Course 3\",Général!#REF!,Général!I$78)))","v":0},{"$f":"IF($I$5=\"Course 1\",Général!I$82,IF($I$5=\"Course 2\",Général!I$84,IF($I$5=\"Course 3\",Général!#REF!,Général!I$86)))","v":0},{"$f":"IF($J$5=\"Course 1\",Général!I$90,IF($J$5=\"Course 2\",Général!I$92,IF($J$5=\"Course 3\",Général!#REF!,Général!I$94)))","v":0},{"$f":"IF($K$5=\"Course 1\",Général!I$98,IF($K$5=\"Course 2\",Général!I$100,IF($K$5=\"Course 3\",Général!#REF!,Général!I$102)))","v":0},{"$f":"IF($L$5=\"Course 1\",Général!I$106,IF($L$5=\"Course 2\",Général!I$108,IF($L$5=\"Course 3\",Général!#REF!,Général!I$110)))","v":0},{"$f":"IF($M$5=\"Course 1\",Général!I$114,IF($M$5=\"Course 2\",Général!I$116,IF($M$5=\"Course 3\",Général!#REF!,Général!I$118)))","v":0},{"$f":"IF($N$5=\"Course 1\",Général!I$122,IF($N$5=\"Course 2\",Général!I$124,IF($N$5=\"Course 3\",Général!#REF!,Général!I$126)))","v":0},{"$f":"IF($O$5=\"Course 1\",Général!I$130,IF($O$5=\"Course 2\",Général!I$132,IF($O$5=\"Course 3\",Général!#REF!,Général!I$134)))","v":0},{"$f":"IF($P$5=\"Course 1\",Général!I$138,IF($P$5=\"Course 2\",Général!I$140,IF($P$5=\"Course 3\",Général!#REF!,Général!I$142)))","v":0},{"$f":"IF($Q$5=\"Course 1\",Général!I$146,IF($Q$5=\"Course 2\",Général!I$148,IF($Q$5=\"Course 3\",Général!#REF!,Général!I$150)))","v":0},{"$f":"IF($R$5=\"Course 1\",Général!I$154,IF($R$5=\"Course 2\",Général!I$156,IF($R$5=\"Course 3\",Général!I$158,Général!I$160)))","v":0},null,null,null,{"$f":"Général!B15","v":"Equipage 15"},0]
["9ème Equipage",null,{"$f":"IF($C$5=\"Course 1\",Général!J34,IF($C$5=\"Course 2\",Général!J36,IF($C$5=\"Course 3\",Général!#REF!,Général!J38)))","v":0},{"$f":"IF($D$5=\"Course 1\",Général!J42,IF($D$5=\"Course 2\",Général!J44,IF($D$5=\"Course 3\",Général!#REF!,Général!J46)))","v":0},{"$f":"IF($E$5=\"Course 1\",Général!J50,IF($E$5=\"Course 2\",Général!J52,IF($E$5=\"Course 3\",Général!#REF!,Général!J54)))","v":0},{"$f":"IF($F$5=\"Course 1\",Général!J$58,IF($F$5=\"Course 2\",Général!J$60,IF($F$5=\"Course 3\",Général!#REF!,Général!J$62)))","v":0},{"$f":"IF($G$5=\"Course 1\",Général!J$66,IF($G$5=\"Course 2\",Général!J$68,IF($G$5=\"Course 3\",Général!#REF!,Général!J$70)))","v":0},{"$f":"IF($H$5=\"Course 1\",Général!J$74,IF($H$5=\"Course 2\",Général!J$76,IF($H$5=\"Course 3\",Général!#REF!,Général!J$78)))","v":0},{"$f":"IF($I$5=\"Course 1\",Général!J$82,IF($I$5=\"Course 2\",Général!J$84,IF($I$5=\"Course 3\",Général!#REF!,Général!J$86)))","v":0},{"$f":"IF($J$5=\"Course 1\",Général!J$90,IF($J$5=\"Course 2\",Général!J$92,IF($J$5=\"Course 3\",Général!#REF!,Général!J$94)))","v":0},{"$f":"IF($K$5=\"Course 1\",Général!J$98,IF($K$5=\"Course 2\",Général!J$100,IF($K$5=\"Course 3\",Général!#REF!,Général!J$102)))","v":0},{"$f":"IF($L$5=\"Course 1\",Général!J$106,IF($L$5=\"Course 2\",Général!J$108,IF($L$5=\"Course 3\",Général!#REF!,Général!J$110)))","v":0},{"$f":"IF($M$5=\"Course 1\",Général!J$114,IF($M$5=\"Course 2\",Général!J$116,IF($M$5=\"Course 3\",Général!#REF!,Général!J$118)))","v":0},{"$f":"IF($N$5=\"Course 1\",Général!J$122,IF($N$5=\"Course 2\",Général!J$124,IF($N$5=\"Course 3\",Général!#REF!,Général!J$126)))","v":0},{"$f":"IF($O$5=\"Course 1\",Général!J$130,IF($O$5=\"Course 2\",Général!J$132,IF($O$5=\"Course 3\",Général!#REF!,Général!J$134)))","v":0},{"$f":"IF($P$5=\"Course 1\",Général!J$138,IF($P$5=\"Course 2\",Général!J$140,IF($P$5=\"Course 3\",Général!#REF!,Général!J$142)))","v":0},{"$f":"IF($Q$5=\"Course 1\",Général!J$146,IF($Q$5=\"Course 2\",Général!J$148,IF($Q$5=\"Course 3\",Général!#REF!,Général!J$150)))","v":0},{"$f":"IF($R$5=\"Course 1\",Général!J$154,IF($R$5=\"Course 2\",Général!J$156,IF($R$5=\"Course 3\",Général!J$158,Général!J$160)))","v":0},null,null,null,{"$f":"Général!B16","v":"Equipage 16"},0]
["10ème Equipage",null,{"$f":"IF($C$5=\"Course 1\",Général!K34,IF($C$5=\"Course 2\",Général!K36,IF($C$5=\"Course 3\",Général!#REF!,Général!K38)))","v":0},{"$f":"IF($D$5=\"Course 1\",Général!K42,IF($D$5=\"Course 2\",Général!K44,IF($D$5=\"Course 3\",Général!#REF!,Général!K46)))","v":0},{"$f":"IF($E$5=\"Course 1\",Général!K50,IF($E$5=\"Course 2\",Général!K52,IF($E$5=\"Course 3\",Général!#REF!,Général!K54)))","v":0},{"$f":"IF($F$5=\"Course 1\",Général!K$58,IF($F$5=\"Course 2\",Général!K$60,IF($F$5=\"Course 3\",Général!#REF!,Général!K$62)))","v":0},{"$f":"IF($G$5=\"Course 1\",Général!K$66,IF($G$5=\"Course 2\",Général!K$68,IF($G$5=\"Course 3\",Général!#REF!,Général!K$70)))","v":0},{"$f":"IF($H$5=\"Course 1\",Général!K$74,IF($H$5=\"Course 2\",Général!K$76,IF($H$5=\"Course 3\",Général!#REF!,Général!K$78)))","v":0},{"$f":"IF($I$5=\"Course 1\",Général!K$82,IF($I$5=\"Course 2\",Général!K$84,IF($I$5=\"Course 3\",Général!#REF!,Général!K$86)))","v":0},{"$f":"IF($J$5=\"Course 1\",Général!K$90,IF($J$5=\"Course 2\",Général!K$92,IF($J$5=\"Course 3\",Général!#REF!,Général!K$94)))","v":0},{"$f":"IF($K$5=\"Course 1\",Général!K$98,IF($K$5=\"Course 2\",Général!K$100,IF($K$5=\"Course 3\",Général!#REF!,Général!K$102)))","v":0},{"$f":"IF($L$5=\"Course 1\",Général!K$106,IF($L$5=\"Course 2\",Général!K$108,IF($L$5=\"Course 3\",Général!#REF!,Général!K$110)))","v":0},{"$f":"IF($M$5=\"Course 1\",Général!K$114,IF($M$5=\"Course 2\",Général!K$116,IF($M$5=\"Course 3\",Général!#REF!,Général!K$118)))","v":0},{"$f":"IF($N$5=\"Course 1\",Général!K$122,IF($N$5=\"Course 2\",Général!K$124,IF($N$5=\"Course 3\",Général!#REF!,Général!K$126)))","v":0},{"$f":"IF($O$5=\"Course 1\",Général!K$130,IF($O$5=\"Course 2\",Général!K$132,IF($O$5=\"Course 3\",Général!#REF!,Général!K$134)))","v":0},{"$f":"IF($P$5=\"Course 1\",Général!K$138,IF($P$5=\"Course 2\",Général!K$140,IF($P$5=\"Course 3\",Général!#REF!,Général!K$142)))","v":0},{"$f":"IF($Q$5=\"Course 1\",Général!K$146,IF($Q$5=\"Course 2\",Général!K$148,IF($Q$5=\"Course 3\",Général!#REF!,Général!K$150)))","v":0},{"$f":"IF($R$5=\"Course 1\",Général!K$154,IF($R$5=\"Course 2\",Général!K$156,IF($R$5=\"Course 3\",Général!K$158,Général!K$160)))","v":0},null,null,null,{"$f":"Général!B17","v":"Equipage 17"},0]
[null,null,null,null,null,null,null,null,null,null,null,null,null,null,null,null,null,null,null,null,null,{"$f":"Général!B18","v":"Equipage 18"},0]
[null,null,null,null,null,null,null,null,null,null,null,null,null,null,null,null,null,null,null,null,null,{"$f":"Général!B19","v":"Equipage 19"},0]
[null,null,null,null,null,null,null,null,null,null,null,null,null,null,null,null,null,null,null,null,null,{"$f":"Général!B20","v":"Equipage 20"},0]
[null,null,null,null,null,null,null,null,null,null,null,null,null,null,null,null,null,null,null,null,null,{"$f":"Général!B21","v":"Equipage 21"},0]
[null,null,null,null,null,null,null,null,null,null,null,null,null,null,null,null,null,null,null,null,null,{"$f":"Général!B22","v":"Equipage 22"},0]
[null,null,null,null,null,null,null,null,null,null,null,null,null,null,null,null,null,null,null,null,null,{"$f":"Général!B23","v":"Equipage 23"},0]
[null,null,null,null,null,null,null,null,null,null,null,null,null,null,null,null,null,null,null,null,null,{"$f":"Général!B24","v":"Equipage 24"},0]
[null,null,null,null,null,null,null,null,null,null,null,null,null,null,null,null,null,null,null,null,null,{"$f":"Général!B25","v":"Equipage 25"},0]
[null,null,null,null,null,null,null,null,null,null,null,null,null,null,null,null,null,null,null,null,null,{"$f":"Général!B26","v":"Equipage 26"},0]
[null,null,null,null,null,null,null,null,null,null,null,null,null,null,null,null,null,null,null,null,null,{"$f":"Général!B27","v":"Equipage 27"},0]
[null,null,null,null,null,null,null,null,null,null,null,null,null,null,null,null,null,null,null,null,null,{"$f":"Général!B28","v":"Equipage 28"},0]
[null,null,null,null,null,null,null,null,null,null,null,null,null,null,null,null,null,null,null,null,null,{"$f":"Général!B29","v":"Equipage 29"},0]
[null,null,null,null,null,null,null,null,null,null,null,null,null,null,null,null,null,null,null,null,null,{"$f":"Général!B30","v":"Equipage 30"},0]